{"text_format":"1","workbook":"xlsx","n_sheets":25,"sheets":["Introduction","Advocacy","IntroandAdvocacy","Definition of variables","References","Acknowledgement","Main Menu","Acknowledge & References","Country","Mother","Mother Calculator","MCalibration","Country Data","Data Entry","BF Rate Chart","Result-Lost Milk Estimate","Results Compare","References & Literature","Definition of Terms","BF computation","BF Entry Compute","Calibration Matrix ","Database","Database 2","Sheet2"],"not_rendered":{"charts":1,"images":27,"macros":1,"external_links":2,"defined_names":57,"comments":1,"pivot_tables":0},"unopened":[],"bounds":{"document_bytes":16777216,"sheet_cells":100000,"rows_first":2000,"rows_last":500,"rows_between":2000,"halvings":0,"cell_chars":16384,"cell_head_chars":4096},"cells_cut":0,"cells_raw":0,"read":"whole","date_system":"1900"}

{"sheet":"Introduction","index":0,"n_rows":3,"n_cols":2,"rows_kept":3,"cut":false,"hidden":false,"merged":[[70,5,70,11],[59,5,59,11],[60,5,60,11],[61,5,61,11],[64,5,64,11],[55,5,55,11],[56,5,56,11],[57,5,57,11],[58,5,58,11],[66,5,66,11],[63,5,63,11],[49,5,49,11],[50,5,50,11],[51,5,51,11],[52,5,52,11],[53,5,53,11],[44,5,44,11],[45,5,45,11],[46,5,46,11],[47,5,47,11],[48,5,48,11],[21,5,21,11],[22,5,22,11],[36,5,36,11],[42,5,42,11],[43,5,43,11],[3,5,3,6],[0,1,1,5],[6,5,6,11],[7,5,16,11],[19,5,19,11]]}
[null,"Mothers' Milk Tool"]
[]
[null,"Introduction"]

{"sheet":"Advocacy","index":1,"n_rows":1,"n_cols":1,"rows_kept":1,"cut":false,"hidden":true,"merged":[]}
["Advocacy"]

{"sheet":"IntroandAdvocacy","index":2,"n_rows":3,"n_cols":2,"rows_kept":3,"cut":false,"hidden":true,"merged":[[70,5,70,11],[59,5,59,11],[60,5,60,11],[61,5,61,11],[63,5,63,11],[64,5,64,11],[66,5,66,11],[58,5,58,11],[46,5,46,11],[47,5,47,11],[48,5,48,11],[49,5,49,11],[50,5,50,11],[51,5,51,11],[52,5,52,11],[53,5,53,11],[55,5,55,11],[56,5,56,11],[57,5,57,11],[45,5,45,11],[0,1,1,5],[3,5,3,6],[6,5,6,11],[7,5,16,11],[19,5,19,11],[21,5,21,11],[22,5,22,11],[36,5,36,11],[42,5,42,11],[43,5,43,11],[44,5,44,11]]}
[null,"Mothers' Milk Tool"]
[]
[null,"Introduction"]

{"sheet":"Definition of variables","index":3,"n_rows":51,"n_cols":11,"rows_kept":51,"cut":false,"hidden":true,"merged":[[6,7,8,7],[11,7,18,7],[22,7,26,7],[39,7,45,7]]}
[null,"Definition of variable used"]
[]
[null,"#","Code","Description ","Definition ","Type ","Formula","Explanation of measurement","Web link","Note"]
[null,null,null,"Population Data "]
[null,1,"AnLB","Annual live births ","The annual number of live births is defined as the number of live births taking place in a certain country or area during a year. Unless otherwise specified, the reference period for the number of live births presented in World Fertility Data 2008 is the calendar year","FIX","NA",null,"https://population.un.org/wpp/DataQuery/  & "]
[null,null,null,"Breastfeeding Practices"]
[null,2,"EBF","Exclusive Breastfeeding (0 to <6 )","Breast milk from mother or wet nurse or expressed breast milk, NO other liquids or solids except vitamin drops or syrups, mineral supplements, or prescribed medicines ","FIX","Value = Population (age group)  x Daily yields   ","Calculations are for any breastfeeding and do not distinguish exclusive or full breastfeeding, because some countries lack such data. This means it is a minimum estimate of the milk produced. Better country data on breastfeeding is needed for more accurate estimates, particularly for high income countries. The Tool uses official breastfeeding data and covers 0-36 months. For many countries this is available through the Demographic and Health Surveys (DHS) & Multiple Indicator Cluster Surveys (MICS). If your country has inadequate official breastfeeding data for each month of age 0-36 months, the Tool includes an automatic process that can fill the gaps for most countries. It can do this if you can add three or more data points for any breastfeeding rates, by clicking the data entry button at Step 3 in the country calculator. This process assumes that fewer than 1% of children are breastfeeding at 3 years, though this is an underestimate for some countries. The process uses a regression model to fill data gaps based on a cubic function which was found to be the best fit.","https://data.unicef.org/resources/dataset/infant-young-child-feeding/ ","Alternative resources OECD Family Database: http://www.oecd.org/social/family/database.htm "]
[null,{"$f":"B7+1","v":3},"PBF","Full or predominant breastfeeding  (0 to <6 mos.)","• Breast milk from mother or wet nurse or expressed breast milk\n• Water and water-based drinks\n• NO food-based fluid with the exception of fruit juice and sugar water","FIX","Value = Population (age group)  x Daily yields   ",null,"https://data.unicef.org/resources/dataset/infant-young-child-feeding/ ","Alternative resources OECD Family Database: http://www.oecd.org/social/family/database.htm "]
[null,4,"PaBF","Partial (BF+Foods, Liquids, Milk etc ) (0 to <6 mos.)","• Breast milk from mother or wet nurse or expressed breast milk\n• Any other liquids or non-liquids, including both milk and non-milk products                                              Vitamin drops or syrups, mineral supplements, or prescribed medicines","FIX",null,null,"https://data.unicef.org/resources/dataset/infant-young-child-feeding/ ","Alternative resources OECD Family Database: http://www.oecd.org/social/family/database.htm "]
[null,5,"NotBF","Not breastfeeding (0-<6 mos. of age)","Formula, animal’s milk and/or solid, semisolid or soft food\nNO breast milk","FIX",null,null,"https://data.unicef.org/resources/dataset/infant-young-child-feeding/ ","alternative resources OECD Family Database: http://www.oecd.org/social/family/database.htm "]
[null,6,"NotBFW","Not breastfeeding women (Never) ","women with infants, that have never breastfed ","FIX","estimated at 5% (10%) ",null,"https://www.unicef.org/reports ","Ever breastfeeding rates of a country (if available can be used to estimate the never breastfeeding rate of that particular country) ; "]
[null,7,"BFmo","Breastfeeding at \"each month\" 0, 1, 2, 3, 4, 5, 6, 7, 8, 9, 10, 11, 12  etc","Breastfeeding prevalence by month","1. Provided in National surveys 2. Calculated with the prediction model or 3. extracted from the row national surveys (e.g., DHS, MICS, others)",null,"If your country has inadequate official breastfeeding data for each month of age 0-36 months, the Tool includes an automatic process that can fill the gaps for most countries. It can do this if you can add three or more data points for any breastfeeding rates, by clicking the data entry button at Step 3 in the country calculator. This process assumes that fewer than 1% of children are breastfeeding at 3 years, though this is an underestimate for some countries. The process uses a regression model to fill data gaps based on a cubic function which was found to be the best fit.","1. https://dhsprogram.com/data/available-datasets.cfm 2. https://mics.unicef.org/surveys ","https://www.omnicalculator.com/statistics/cubic-regression#definition-of-cubic-regression"]
[null,8,"BF6months","Breastfeeding at 6 months","Proportion of infants that at 4 to 5.9 months are still breastfeeding","Calculated","Infants at 4 to 5.9 months (EBF+any BF)-Infants at 4 to 5.9 months  Not BF anymore",null,"https://data.unicef.org/resources/dataset/infant-young-child-feeding/ "]
[null,9,"BF6-12months","Breastfeeding from 6 to 11.9 months","Average proportion of children that are breastfeeding between 6 to 12 months ","Calculated","Average (BF6months and BF1Y)",null,"https://data.unicef.org/resources/dataset/infant-young-child-feeding/ "]
[null,10,"BF1Y","Breastfeeding at 12 months (12 to 14.9 months)","Proportion of children 12–14.99 months of age who are fed breast milk;","FIXED","NA",null,"https://data.unicef.org/resources/dataset/infant-young-child-feeding/ ","alternative resources OECD Family Database: http://www.oecd.org/social/family/database.htm "]
[null,11,"BF1to2Yrs","Continued breastfeeding 12 to 23.9 months ","Proportion of children 12 to 23.9 months of agre who are fed also breast milk","FIXED","NA",null,"https://data.unicef.org/resources/dataset/infant-young-child-feeding/ ","alternative resources OECD Family Database: http://www.oecd.org/social/family/database.htm "]
[null,12,"BF2to3Yrs","Continued breastfeeding 24 to 35.9 months ","Proportion of children 12 to 23.9 months of agre who are fed also breast milk","FIXED","NA",null,"https://data.unicef.org/resources/dataset/infant-young-child-feeding/ ","alternative resources OECD Family Database: http://www.oecd.org/social/family/database.htm "]
[null,13,"BF2Y","Breastfeeding at 2 years of age (20 to 23.9 months)","Proportion of children 20-24 months of age who are fed breast milk","FIXED","NA",null,"https://data.unicef.org/resources/dataset/infant-young-child-feeding/ ","alternative resources OECD Family Database: http://www.oecd.org/social/family/database.htm "]
[null,14,"BF3Y","Breastfeeding at 3 years of age (24 to 35.9 months)","Proportion of children 24-35.9 months of age who are fed breast milk","FIXED","NA",null,"https://data.unicef.org/resources/dataset/infant-young-child-feeding/ "]
[null,null,null,"Breastmilk yelds daily"]
[null,15,"DBMYi","Daily breast milk yields by age in months (0,1,2,3,4,5,6,7,8,9,10,11,12,13,14,15,16,17,18,19,20,21,22,23)","Human milk intake of children  at the specific age","FIXED","NA","The Tool assumes that a breastfeeding mother will produce about 431 litres of milk during 36 months of lactation (or 345 litres over 2 years). This is based on scientific studies, and is a conservative assumption. ","https://www.who.int/nutrition/publications/nut_adequacy_of_exc_bfeeding_eng.pdf ","For infants <12 months, see Butte, N., et al. (2002). Nutrient adequacy of exclusive breastfeeding for the term infant during the first 6 months of life. Geneva, World Health Organization. Butte et al did not estimate the yields for children above 12 months. For children 12 months to 3 years see Hatloy A, Oshaug A. Human milk: an invisible food resource. J Hum Lact 1997;13:299-305.\n. "]
[null,null,null,"Breastmilk production for children (biologically feasible potential and actual)"]
[null,16,"BPFO6","Biologically Feasible Potential volume of breastmilk production (million of litres) for infants<6 months of age","Estimated amount in litres of breast milk produced for infants <6 months that is biologically feasible in a certain country (daily/monthly/annual)","Calculated","Volume = Population (age group)  x Prevalence of EBF/Partial  x daily yields  per child (<6 mos.)","Biologically feasible potential volumes are the amounts of milk that would be produced if 98% of mothers breastfed. Historical and current studies show that 98% or more of women can breastfeed.","NA ","Berg A. The nutrition factor; its role in national development: The Brookings Institution; 1973. Sellen DW. Comparison of Infant Feeding Patterns Reported for Nonindustrial Populations with Current Recommendations. J Nutr 2001;131:2707-15. Haggkvist AP, Brantsaeter AL, Grjibovski AM, Helsing E, Meltzer HM, Haugen M. Prevalence of breast-feeding in the Norwegian Mother and Child Cohort Study and health service-related correlates of cessation of full breast-feeding. Public Health Nutr 2010;13:2076-86.  Smith JP. Human milk supply in Australia. Food Policy 1999;24:71-91."]
[null,{"$f":"B23+1","v":17},"BPFO1Y","Biologically Feasible Potential Volume of breastmilk production (million of litres) for infants 6 to 11.9 months of age","Estimated amount in litres of breast milk produced for infants 6 to 11.9 months that is biologically feasible in a certain country (daily/monthly/annual)","Calculated","Volume = Population (age group)  x Prevalence of EBF/Partial  x daily yields  per child (6 to 11.9 mos.)",null,"NA","Berg A. The nutrition factor; its role in national development: The Brookings Institution; 1973. Sellen DW. Comparison of Infant Feeding Patterns Reported for Nonindustrial Populations with Current Recommendations. J Nutr 2001;131:2707-15. Haggkvist AP, Brantsaeter AL, Grjibovski AM, Helsing E, Meltzer HM, Haugen M. Prevalence of breast-feeding in the Norwegian Mother and Child Cohort Study and health service-related correlates of cessation of full breast-feeding. Public Health Nutr 2010;13:2076-86.  Smith JP. Human milk supply in Australia. Food Policy 1999;24:71-91."]
[null,{"$f":"B24+1","v":18},"BPFO2Y","Biologically Feasible Potential volume of breastmilk production (million of litres)  for infants 12 to 23.9 months of age","Estimated amount in kilograms of breast milk produced for infants 12 to 23.9 months that is biologically feasible in a certain country (daily/monthly/annual)","Calculated","Volume = Population (age group)  x Prevalence of EBF/Partial  x daily yields  per child (12 to 24 mos.)",null,"NA","Berg A. The nutrition factor; its role in national development: The Brookings Institution; 1973. Sellen DW. Comparison of Infant Feeding Patterns Reported for Nonindustrial Populations with Current Recommendations. J Nutr 2001;131:2707-15. Haggkvist AP, Brantsaeter AL, Grjibovski AM, Helsing E, Meltzer HM, Haugen M. Prevalence of breast-feeding in the Norwegian Mother and Child Cohort Study and health service-related correlates of cessation of full breast-feeding. Public Health Nutr 2010;13:2076-86.  Smith JP. Human milk supply in Australia. Food Policy 1999;24:71-91."]
[null,19,"BPFO3Y","Biologically Feasible Potential volume of breastmilk production (million of litres)  for infants 24 to 35.9 months of age","Estimated amount in kilograms of breast milk produced for infants 25 to 35.9 months that is biologically feasible in a certain country (daily/monthly/annual)","Calculated","Volume = Population (age group)  x Prevalence of EBF/Partial  x daily yields  per child (25 to 35.9mos.)",null,"NA","Berg A. The nutrition factor; its role in national development: The Brookings Institution; 1973. Sellen DW. Comparison of Infant Feeding Patterns Reported for Nonindustrial Populations with Current Recommendations. J Nutr 2001;131:2707-15. Haggkvist AP, Brantsaeter AL, Grjibovski AM, Helsing E, Meltzer HM, Haugen M. Prevalence of breast-feeding in the Norwegian Mother and Child Cohort Study and health service-related correlates of cessation of full breast-feeding. Public Health Nutr 2010;13:2076-86.  Smith JP. Human milk supply in Australia. Food Policy 1999;24:71-91."]
[null,20,"BPF24mos","Biologically Feasible Potential volume of breastmilk production (million of litres)  for infants 0 to 23.9 months of age","Estimated amount in kilograms of breast milk produced for infants 0 to 23.9 months that is biologically feasible in a certain country (daily/monthly/annual)","Calculated","Volume = Population (age group)  x Prevalence of EBF/Partial  x daily yields  per child (0 to 23.9 mos.)",null,"NA","Berg A. The nutrition factor; its role in national development: The Brookings Institution; 1973. Sellen DW. Comparison of Infant Feeding Patterns Reported for Nonindustrial Populations with Current Recommendations. J Nutr 2001;131:2707-15. Haggkvist AP, Brantsaeter AL, Grjibovski AM, Helsing E, Meltzer HM, Haugen M. Prevalence of breast-feeding in the Norwegian Mother and Child Cohort Study and health service-related correlates of cessation of full breast-feeding. Public Health Nutr 2010;13:2076-86.  Smith JP. Human milk supply in Australia. Food Policy 1999;24:71-91."]
[null,21,"LostBM","Lost Breastmilk","Lost volume of human breastmilk production ","Calculated","Volume Biologically Feasible breastmilk production - Volume Actual human milk production","The lost milk is the difference between the milk actually produced at current breastfeeding rates, and the milk that would be produced if 98% of mothers breastfed for six months and to at least 36 months. Historical and current studies show that 98% or more of women can breastfeed.","NA","Berg A. The nutrition factor; its role in national development: The Brookings Institution; 1973. Sellen DW. Comparison of Infant Feeding Patterns Reported for Nonindustrial Populations with Current Recommendations. J Nutr 2001;131:2707-15. Haggkvist AP, Brantsaeter AL, Grjibovski AM, Helsing E, Meltzer HM, Haugen M. Prevalence of breast-feeding in the Norwegian Mother and Child Cohort Study and health service-related correlates of cessation of full breast-feeding. Public Health Nutr 2010;13:2076-86."]
[null,22,"Volm","Daily breastmilk intake  of breastfeeding infants by age bracket (<6 months, 6, 7, 8, 9, 10, 11 to 11.9 months, 12 to 35.9 months) ","Average amount of breastmilk intake of a child according to age ","FIXED",null,"The Tool assumes that a breastfeeding mother will produce about 431 litres of milk during 36 months of lactation (or 345 litres over 2 years). This is based on scientific studies, and is a conservative assumption. ","NA","For infants <12 months, see Butte, N., et al. (2002). Nutrient adequacy of exclusive breastfeeding for the term infant during the first 6 months of life. Geneva, World Health Organization. Butte et al did not estimate the yields for children above 12 months. For children 12 months to 3 years see Hatloy A, Oshaug A. Human milk: an invisible food resource. J Hum Lact 1997;13:299-305."]
[null,23,"AHMP6","Actual Human Milk Production, Volume (million litres) for infants <6 months","Actual breastmilk production based on breastfeeding prevalence for the age group","Calculated","Volume = Pop x BFPrev x BM Yields",null,"NA"]
[null,24,"AHMP12","Actual Human Milk Production, Volume (million litres) for infants <12 months","Actual breastmilk production based on breastfeeding prevalence for the age group","Calculated","Volume = Pop x BFPrev BM Yields",null,"NA"]
[null,25,"AHMP1223","Actual Human Milk Production Volume (million litres) for children  12 to 23.9 months","Actual breastmilk production based on breastfeeding prevalence for the age group","Calculated","Volume = Pop xBFPrev x BM Yields",null,"NA"]
[null,26,"AHMP023","Actual Human Milk Production Volume (million litres) for children  24 to 35.9 months","Actual breastmilk production based on breastfeeding prevalence for the age group","Calculated","Volume = Pop xBFPrev x BM Yields",null,"NA"]
[null,27,"AHMP24mos","Actual Human Milk Production Volume (million litres) for children  0 to 23.9 months","Actual breastmilk production based on breastfeeding prevalence for the age group","Calculated","Volume = Pop xBFPrev x BM Yields",null,"NA"]
[null,28,"AHMP36mos","Actual Human Milk Production Volume (million litres) for children  0 to 35.9 months","Actual breastmilk production based on breastfeeding prevalence for the age group","Calculated","Volume = Pop xBFPrev x BM Yields",null,"NA"]
[null,29,"PCA","Availability per child of Breastmilk","The amount of breastmilk available for each child 0-23 months of age ","Calculated","PCA=AHMP24mos/023M",null,null,"Not available in version 1.0","2. cost of BF for a mother "]
[null,30,"KtoL","Kilos to Litre conversion factor ","Conversion of 1 kilo of milk into litres","Fix","1 litre is 1.032 kilograms , 1.032 kilograms per litre",null,null,"Not available in version 1.0"]
[null,31,"OtoL","Ounce to Litre conversion factor","Conversion of 1 ounce into litres","Fix","1 ounce is 0.0295735 litre",null,null,"Not available in version 1.0"]
[null,null,null,"Price of breastmilk"]
[null,29,"PriceLBM","Price of one litre of breastmilk (national)","average price of one litre of breastmilk from milk banks or elsewhere","FIXED",null,"The Tool provides a monetary value of the milk produced by mothers to breastfeed their children. It uses a typical price charged by donor human milk banks for fresh milk of $100 per litre (the monetary value is available in US$ and in the local currency). It is approximately $3 per ounce.\nThis is based on the official price charged for fresh donated milk within Norway’s human milk banking system. Other milk banks may charge much more for pasteurised donor milk. Various other ways of placing a monetary value on human milk include using the wage of a wetnurse as a proxy, or putting a monetary value on the mother’s time. Using the price of commercial milk formula is not appropriate because it is not an analogous product, and does not take account of the health costs or environmental impacts of its use. For the calculations of the amount and value of human milk produced and lost due at the breastfeeding rates in your country, you can use the monetary value in the tool, or substitute a different price.","NA"]
[null,{"$f":"B40+1","v":30},"WageWN","Wage for wet nursing (daily/monthly)","Average daily/monthly price of recruiting/hiring a wet nurse","FIX ","50 to 200 $USD/day ",null,"Wages for wet nursing","Not available in Version 1.0                                                                    Smith. (2012) Including Household Production in the System of National Accounts (SNA) - Exploring the Implications of Breastfeeding and Human Milk Provision. Paper Prepared for the 32nd General Conference of The International Association for Research in Income and Wealth. Boston, USA, August 5-11, 2012.\nSmith JP (2013) \"Lost milk?\": Counting the economic value of breast milk in gross domestic product. J Hum Lact 29, 537-546."]
[null,31,"WageCC","Wage (Country can place value for this) [Childcare worker to estimate the value of unpaid childcare work)","Average hourly wage of a woman for expressing breastmilk ","Calculated","US$11.16/hour",null,"NA","Not available in Version 1.0                                                           Including Household production in the system of national accounts (SNA) - exploring the implications of breastfeeding and human milk provision \n"]
[null,32,"#minutes","Number of minutes to express (daily)","Estimated number of minutes needed by a mother to express breastmilk","FIX","150 ml (5.3 oz) per hour ",null,"NA","Not available in Version 1.0                                                                Smith, J. P. and R. Forrester. 2013. “Who pays for the health benefits of exclusive breastfeeding? An analysis of maternal time costs.” J Hum Lact 29(4): 547-55."]
[null,33,"#hours","Number of hours to breastfeed (daily)","Time spent on Infant Feeding Activities at Infant Age 6 Months by Feeding Group","FIX","15.4 to 18.7 hours/weekly",null,"NA","Not available in Version 1.0                                                                  Smith, J. P. and R. Forrester. 2013. “Who pays for the health benefits of exclusive breastfeeding? An analysis of maternal time costs.” J Hum Lact 29(4): 547-55."]
[null,34,"TimeCost","Average time cost for Lactating Mother  [estimate separately for expression and breastfeeding]","The estimated time cost incurred by breastfeeding women ","Calculated","Total # of minutes X Wage (daily/weekly/monthly) or #hours X Wage (daily, weekly, monthly) ",null,null,"Not available in Version 1.0"]
[null,30,"GloPRICEBM","Global Indicative Price of breastmilk from Milk Bank ","Average cost of 1 litre of breastmilk (based on human milk bank costs or elsewhere) ","Calculated","US$100 per litre",null,"Global Price of breastmilk ","Grovslien AH, Gronn M. Donor milk banking and breastfeeding in Norway. J Hum Lact 2009; 25(2): 206-10.\nSmith JP (2013) \"Lost milk?\": Counting the economic value of breast milk in gross domestic product. J Hum Lact 29, 537-546.\nGrøvslien, A. H. (2021). Personal communication, 28 June.\nin Norway. J Hum Last. 2009;25(2):206-210. Smith JP. Human milk supply in Australia. Food Policy 1999;24:71-91."]
[null,31,"CostBFWRA","Additional food cost  for a breastfeeding mother (640 Kcal/day)","Cost for additional diet to meet the needs of a breastfeedinh woman ","FIX","(additional kcal per day/total kcal day) * total daily cost in $USD",null,"http://www.fao.org/3/M2998E/M2998E00.htm ; http://www.fao.org/3/y5686e/y5686e0b.htm","Not available in version 1.0                                                              FAO/WFP Tool for cost of the diet and type, Karlsoon and Rollins"]
[null,32,"CostWRA","Cost per 2250 kilocalories (adult equiv.) of balanced diet ($)","(Depending on the current adequacy of women's energy and nutrient's  intake)Women's needs for energy and most nutrients increase during pregnancy and breastfeeding. When breastfeeding they need about 450 extra kcal/day and much more protein, zinc, vitamin A, vitamin C and folate (i.e. the equivalent of an extra small meal each day).You can suggest that women eat more at each meal or eat more frequently - perhaps having more snacks during the day.","FIX","3.75 daily  $USD global median across 170 countries (3.27 to 4.57 $USD/daily) - cost of a health diet ",null,"http://www.fao.org/3/cb2431en/CB2431EN.pdf","Not available in Version 1.0     1. Estimate by population group (lowest 2 or 4 deciles) 2. by countries (what is the proportion of these population groups) ??? "]
[null,31,"Exch","Exchange rate of national currency vs. $USD","The exchange rate is the rate at which one national currency will be exchanged for $USD. ","Variable ","NA","When the user chooses a country in the country or mother calculator, this is used to convert values to local currency. ","https://treasury.un.org/operationalrates/OperationalRates.php","1. official national bank exchange rates can also be used "]
[null,{"$f":"B49+1","v":32},"Vbio$","Value of biologically feasible production of breastmilk in $USD","The value in $USD of the biologically feasible volume that could be produced in the country ","Variable ",null,null,"NA"]
[null,33,"Vact$","Value of  actual production of breastmilk in $USD","The actual value in $USD of the volume of breastmilk produced in the year in the country ","Variable ",null,null,"NA"]

{"sheet":"References","index":4,"n_rows":53,"n_cols":3,"rows_kept":53,"cut":false,"hidden":true,"merged":[]}
["Relevant literature "]
["Studies providing information used in the tool"]
[]
[]
[]
[]
[]
[]
[null,"Number of infants and young children"]
[]
[null,"1.       United Nations. (2019). World Population Prospects 2019 ST/ESA/SER.A/423  https://population.un.org/wpp/Download/Standard/Population/"]
[]
[null,"Country breastfeeding practices and biological feasible potential breastfeeding"]
[]
[null,"1.       UNICEF Global database 2021. Available from: https://data.unicef.org/topic/nutrition/breastfeeding/."]
[null,"2.       Rollins, N. C., et al. (2016). \"Why invest, and what it will take to improve breastfeeding practices?\" Lancet 387(10017): 491-504."]
[null,"3.       Haggkvist, A. P., et al. (2010). \"Prevalence of breast-feeding in the Norwegian Mother and Child Cohort Study and health service-related"]
[null,null,"correlates of cessation of full breast-feeding. \" Public Health Nutrition 13(12): 2076-2086. "]
[null,"4.       Sellen, D. W. (2001). \"Comparison of infant feeding patterns reported for nonindustrial populations with current recommendations."]
[null,null,"Journal of Nutrition 131(10): 2707-2715."]
[]
[null,"Daily milk intakes"]
[]
[null,"1.       Hatloy A & Oshaug A (1997) Human milk: an invisible food resource. J Hum Lact 13, 299-305."]
[null,"2.       Butte, N., et al. (2002). Nutrient adequacy of exclusive breastfeeding for the term infant during the first 6 months of life. Geneva,"]
[null,null,"World Health Organization."]
[]
[null,"Monetary value of human milk"]
[]
[null,"1.       Grovslien AH, Gronn M. Donor milk banking and breastfeeding in Norway. J Hum Lact 2009; 25(2): 206-10."]
[null,"2.       Smith JP (2013) \"Lost milk?\": Counting the economic value of breast milk in gross domestic product. J Hum Lact 29, 537-546."]
[null,"3.       Grøvslien, A. H. (2021). Personal communication, 28 June."]
[]
[null,"Methodological aspects: Studies of the economic value of breastfeeding"]
[]
[null,"1.       Berg A (1973) The crisis in infant feeding practices. In The nutrition factor; its role in national development [A Berg, editor]. "]
[null,null,"Washington: The Brookings Institution."]
[null,"2.       Rohde JE (1981) Mother milk and the Indonesian economy: a major national resource. Indian journal of pediatrics 48, 125-132."]
[null,"3.       Almroth S & Greiner T (1979) The economic value of breastfeeding. vol. Number 6, Monograph Series. New York: Cornell University "]
[null,null,"Program on International Nutrition."]
[null,"4.       Oshaug A & Botten G (1994) Human milk in food supply statistics. Food Policy 19, 479-482."]
[null,"5.       Hatloy A & Oshaug A (1997) Human milk: an invisible food resource. J Hum Lact 13, 299-305."]
[null,"6.       Gupta A & Khanna K (1999) Economic value of breastfeeding in India. Natl Med J India 12, 123-127."]
[null,"7.       Smith JP (1999) Human milk supply in Australia. Food Policy 24, 71-91."]
[null,"8.       Aguayo VM, Ross J, Saunero R et al. (2001) [Monetary value of breast milk in Bolivia]. Rev Panam Salud Publica 10, 249-256."]
[null,"9.       Ross J, Chunming C, ZAZhenying F et al. (2001) Calculating the effects of malnutrition on econmic productivity health and survival "]
[null,null,"in China using PROFILES. New York."]
[null,"10.     Aguayo VM & Ross J (2002) The monetary value of human milk in Francophone west Africa: a PROFILES analysis for nutrition policy "]
[null,null,"communication. Food Nutr Bull 23, 153-161."]
[null,"11.     Smith. (2012) Including Household Production in the System of National Accounts (SNA) - Exploring the Implications of Breastfeeding and "]
[null,null,"Human Milk Provision. Paper Prepared for the 32nd General Conference of The International Association for Research in Income and"]
[null,null,"Wealth. Boston, USA, August 5-11, 2012."]
[null,"12.    Smith JP (2013) \"Lost milk?\": Counting the economic value of breast milk in gross domestic product. J Hum Lact 29, 537-546."]

{"sheet":"Acknowledgement","index":5,"n_rows":12,"n_cols":2,"rows_kept":12,"cut":false,"hidden":true,"merged":[]}
["Acknowledgement "]
[]
[]
[]
[]
[]
[]
[null,"This Tool was commissioned by the Innovation Incubator at FHI Solutions. "]
[null,"FHI Solutions is a subsidiary of FHI 360 and an international nonprofit supported "]
[null,"by three Centers of Excellence including Alive & Thrive, Intake and 1,000 Days. "]
[null,"We would also like to acknowledge research funding support from the Australian Research "]
[null,"Council (FT140101260)."]

{"sheet":"Main Menu","index":6,"n_rows":2,"n_cols":2,"rows_kept":2,"cut":false,"hidden":false,"merged":[[3,8,5,15],[19,8,20,16]]}
[null,"Mothers' Milk Tool"]
[null,"Main menu"]

{"sheet":"Acknowledge & References","index":7,"n_rows":0,"n_cols":0,"rows_kept":0,"cut":false,"hidden":true,"merged":[]}

{"sheet":"Country","index":8,"n_rows":8,"n_cols":8,"rows_kept":8,"cut":false,"hidden":true,"merged":[[7,7,7,13]]}
[null,"Mothers' Milk Tool"]
[null,"Country calculator"]
[]
[]
[]
[]
[]
[null,null,null,null,null,null,null,"Iraq"]

{"sheet":"Mother","index":9,"n_rows":8,"n_cols":9,"rows_kept":8,"cut":false,"hidden":true,"merged":[[7,5,7,11]]}
["Mothers' Milk Tool"]
["Individual calculator"]
[]
[]
[]
[]
[]
[null,null,null,null,null,"El Salvador",null,null,"Armenia"]

{"sheet":"Mother Calculator","index":10,"n_rows":24,"n_cols":16,"rows_kept":24,"cut":false,"hidden":true,"merged":[[18,12,19,12],[12,13,13,13],[12,14,13,14],[12,15,13,15],[18,13,19,13],[16,15,17,15],[18,14,19,14],[18,15,19,15],[8,4,9,9],[15,23,15,25],[2,16,2,17],[2,19,4,22],[3,16,4,17],[8,12,9,15],[14,12,15,12],[12,12,13,12],[14,13,15,13],[14,14,15,14],[14,15,15,15]]}
["Mothers' Milk Tool"]
["Individual production and value"]
[]
[]
[]
[]
[null,null,null,null,{"$f":"CONCATENATE(\" \",Mother!F8)","v":" El Salvador"}]
[]
[null,null,null,null,"Any breastfeeding (BF)",null,null,null,null,null,null,null,"Mother's milk volume and value for the child"]
[]
[null,null,null,null,"Month","BF (Y)","Month","BF (Y)","Month","BF (Y)",null,null,"Total for the breastfeeding period ","Volume","Value ","Value"]
[null,null,null,null,"0 < 1",null,"12 < 13",null,"24 < 25",null,null,null,{"$f":"CONCATENATE(\"(Estimate for \", $J$24,\" data entries)\")","v":"(Estimate for 0 data entries)"}," in Liters ","in  USD","in local currency"]
[null,null,null,null,"1 < 2",null,"13 <14",null,"25 < 26",null,null,null,"1. Actual production of breastmilk ",{"$f":"MCalibration!R45","v":0},{"$f":"MCalibration!X45","v":0},{"$f":"MCalibration!AA45","v":0}]
[null,null,null,null,"2 < 3",null,"14 < 15",null,"26 < 27"]
[null,null,null,null,"3 < 4",null,"15 < 16",null,"27 < 28"]
[null,null,null,null,"4 < 5",null,"16 < 17",null,"28 < 29"]
[null,null,null,null,"5 < 6",null,"17 < 18",null,"29 < 30",null,null,null,{"$f":"_xlfn.CONCAT(\"Default price/liter of breastmilk: \",VLOOKUP(Mother!F8,Database!B2:F233,5,TRUE)*100,\" \", VLOOKUP(Mother!F8,Database!B2:F233,2,TRUE))","v":"Default price/liter of breastmilk: 100 US Dollar                               "}]
[null,null,null,null,"6 < 7",null,"18 < 19",null,"30 < 31",null,null,null,{"$f":"_xlfn.CONCAT(\"Rate to US$1: \", VLOOKUP(Mother!F8,Database!B2:F233,5,TRUE), \" \",VLOOKUP(Mother!F8,Database!B2:F233,2,TRUE))","v":"Rate to US$1: 1 US Dollar                               "}]
[null,null,null,null,"7 < 8",null,"19 < 20",null,"31 < 32"]
[null,null,null,null,"8 < 9",null,"20 < 21",null,"32 < 33"]
[null,null,null,null,"9 < 10",null,"21 < 22",null,"33 < 34",null,null,null,"Enter price/liter of breastmilk in local currency:"]
[null,null,null,null,"10 < 11",null,"22 < 23",null,"34 < 35"]
[null,null,null,null,"11 < 12",null,"23 < 24",null,"35 < 36"]
[null,null,null,null,"Number of Data Points (Y) Entered:",null,null,null,null,{"$f":"COUNTIF(F12:J23,\"Y\")","v":0}]

{"sheet":"MCalibration","index":11,"n_rows":59,"n_cols":36,"rows_kept":59,"cut":false,"hidden":true,"merged":[[0,1,0,35],[3,1,3,14],[3,15,3,28],[3,32,3,35]]}
[]
[null,"Country Name:",null,null,null,"National Currency:",null,null,null,"Year:"]
[null,null,null,null,null,null,"Rate to US$",{"$f":"VLOOKUP(Mother!F8,Database!B2:F233,5,TRUE)","v":1},null,"Liverbirths:",1]
[null,"INPUT VALUES ",null,null,null,null,null,null,null,null,null,null,null,null,null,"CALCULATED VALUES (Year, census)",null,null,null,null,null,null,null,null,null,null,null,null,null,null,null,null,"OPTIONAL"]
[null,"Age","Percent of","Percent of","Percent of","Potential","Average no. of","No. of infants","No. of infants","No. of infants","No. of infants ","Liters of","Liters of","Estimated liters","Estimated liters","Annual production of","Annual production of","Total Actual Annual production of","Average annual production ","Biologically feasible potential production of ","Lost BM [actual-biologically feasible]","Lost production value ","Price per liter of breastmilk","Value actual production of breastmilk","Value Biologically feasible breastmilk","Loss value  of breastmilk","Value actual production of breastmilk ","Value Biologically feasible breastmilk","Loss value  of breastmilk","TOTAL  0-11 MONTHS",null,null,"Cost of additional diet for actual breastfeeding mother ","Total actual annual cost","Cost of additional diet for actual  breastfeeding mother ","Total actual annual cost"]
[null,"<months>","infants","infants","infants","infants","infants living","breastfed fully/exclusively",{"$f":"_xlfn.CONCAT(\"breastfed (partially/any breastfeeding) \")","v":"breastfed (partially/any breastfeeding) "},"not breastfeeding ","breastfed","breastmilk","breastmilk","fully pr. month pr.","partially  pr. month pr.","breastmilk (fully)","breastmilk (partial)","breastmilk ","of breastmilk per child ","breastmilk","breastmilk","% of potential breastmilk production","($US)","in $US","in $US","in $US",{"$f":"Currency","v":"Iraqi Dinar                             "},{"$f":"Currency","v":"Iraqi Dinar                             "},{"$f":"Currency","v":"Iraqi Dinar                             "},null,null,null,"in $USD ","in million $USD",{"$f":"_xlfn.CONCAT(\"in million) \",'Country Data'!Currency,\"\")","v":"in million) Iraqi Dinar                             "},{"$f":"_xlfn.CONCAT(\"in million) \",'Country Data'!Currency,\"\")","v":"in million) Iraqi Dinar                             "}]
[null,null,"breastfed (fully/exclusive)-YEAR ",{"$f":"_xlfn.CONCAT(\"breastfed (partially/any breastfeeding) \",Source,\" \", 'Country Data'!BFYear)","v":"breastfed (partially/any breastfeeding) Full data, Source: MICS 2018"},{"$f":"_xlfn.CONCAT(\"Not  breastfeeding \",Source,\" \", 'Country Data'!BFYear)","v":"Not  breastfeeding Full data, Source: MICS 2018"},"breastfeeding (optimal)","each month a)","each month a)","each month a)","each month a)","potentially each month","fully per  infant pr. day b)","partially  per  infant pr. day b)","infant c) [actual]","infant c) [actual]","Volume ( liters)","Volume ( liters)","Volume ( liters)","litres/child 0-35 months","Volume ( liters)","Volume ( liters)"]
[null,0,null,{"$f":"IF('Mother Calculator'!F12=\"Y\",1,0)","v":0},{"$f":"1-D8","v":1},1,{"$f":"K$3","v":1},{"$f":"G8*C8","v":0},{"$f":"G8*D8","v":0},{"$f":"I8*E8","v":0},{"$f":"G8*F8","v":1},0.67732558139534882,0.59205426356589141,{"$f":"L8*30","v":20.319767441860463},17.761627906976742,{"$f":"N8*H8/1000000","v":0},{"$f":"O8*I8","v":0},{"$f":"SUM(P8:Q8)","v":0},{"$f":"R8/(G8*3)","v":0},{"$f":"IF('Mother Calculator'!F12=\"Y\",K8*O8,0)","v":0},{"$f":"MAX(0,T8-R8)","v":0},{"$f":"U8/T8","v":{"$error":"#DIV/0!"}},{"$f":"IF('Mother Calculator'!$O$21=\"\",$H$3*100,'Mother Calculator'!$O$21)","v":100},{"$f":"W8*R8/$H$3","v":0},{"$f":"W8*T8/$H$3","v":0},{"$f":"Y8-X8","v":0},{"$f":"X8*$H$3","v":0},{"$f":"Y8*$H$3","v":0},{"$f":"AB8-AA8","v":0},null,null,null,{"$f":"(450/2250)*4.57*30","v":27.420000000000005},{"$f":"((H8+I8)*AG8)/1000000","v":0},{"$f":"AH8*CRate","v":0},{"$f":"AI8*(H8+I8)/1000000","v":0}]
[null,{"$f":"B8+1","v":1},null,{"$f":"IF('Mother Calculator'!F13=\"Y\",1,0)","v":0},{"$f":"1-D9","v":1},1,{"$f":"K$3","v":1},{"$f":"G9*C9","v":0},{"$f":"G9*D9","v":0},0,1,0.70833333333333326,0.67538759689922478,21.249999999999996,20.261627906976745,{"$f":"N9*H9/1000000","v":0},{"$f":"O9*I9","v":0},{"$f":"SUM(P9:Q9)","v":0},{"$f":"R9/(G9*3)","v":0},{"$f":"IF('Mother Calculator'!F13=\"Y\",K9*O9,0)","v":0},{"$f":"MAX(0,T9-R9)","v":0},{"$f":"U9/T9","v":{"$error":"#DIV/0!"}},{"$f":"IF('Mother Calculator'!$O$21=\"\",$H$3*100,'Mother Calculator'!$O$21)","v":100},{"$f":"W9*R9/$H$3","v":0},{"$f":"W9*T9/$H$3","v":0},{"$f":"Y9-X9","v":0},{"$f":"X9*$H$3","v":0},{"$f":"Y9*$H$3","v":0},{"$f":"AB9-AA9","v":0},null,null,null,27.420000000000005,{"$f":"((H9+I9)*AG9)/1000000","v":0},{"$f":"AH9*CRate","v":0},{"$f":"AI9*(H9+I9)/1000000","v":0}]
[null,{"$f":"B9+1","v":2},null,{"$f":"IF('Mother Calculator'!F14=\"Y\",1,0)","v":0},1,1,1,0,0,0,1,0.7277131782945736,0.70736434108527124,21.831395348837209,21.220930232558139,0,0,0,0,{"$f":"IF('Mother Calculator'!F14=\"Y\",K10*O10,0)","v":0},0,{"$error":"#DIV/0!"},{"$f":"IF('Mother Calculator'!$O$21=\"\",$H$3*100,'Mother Calculator'!$O$21)","v":100},0,0,0,0,0,0,null,null,null,27.420000000000005,{"$f":"(H10+I10)*AG10/1000000","v":0},0,{"$f":"AI10*(H10+I10)/1000000","v":0}]
[null,3,null,{"$f":"IF('Mother Calculator'!F15=\"Y\",1,0)","v":0},1,1,1,0,0,0,1,0.7558139534883721,0.68217054263565891,22.674418604651162,20.465116279069768,0,0,0,0,{"$f":"IF('Mother Calculator'!F15=\"Y\",K11*O11,0)","v":0},0,{"$error":"#DIV/0!"},{"$f":"IF('Mother Calculator'!$O$21=\"\",$H$3*100,'Mother Calculator'!$O$21)","v":100},0,0,0,0,0,0,null,null,null,27.420000000000005,0,0,{"$f":"AI11*(H11+I11)/1000000","v":0}]
[null,4,null,{"$f":"IF('Mother Calculator'!F16=\"Y\",1,0)","v":0},1,1,1,0,0,0,1,0.77131782945736438,0.68798449612403101,23.13953488372093,20.63953488372093,0,0,0,0,{"$f":"IF('Mother Calculator'!F16=\"Y\",K12*O12,0)","v":0},0,{"$error":"#DIV/0!"},{"$f":"IF('Mother Calculator'!$O$21=\"\",$H$3*100,'Mother Calculator'!$O$21)","v":100},{"$f":"W12*R12/$H$3","v":0},0,0,0,0,0,null,null,null,27.420000000000005,0,0,0]
[null,5,null,{"$f":"IF('Mother Calculator'!F17=\"Y\",1,0)","v":0},1,1,1,0,0,0,1,0.82751937984496116,0.59302325581395343,24.825581395348834,17.790697674418603,0,0,0,0,{"$f":"IF('Mother Calculator'!F17=\"Y\",K13*O13,0)","v":0},0,{"$error":"#DIV/0!"},{"$f":"IF('Mother Calculator'!$O$21=\"\",$H$3*100,'Mother Calculator'!$O$21)","v":100},0,0,0,0,0,0,null,null,null,27.420000000000005,0,0,0]
[null,6,null,{"$f":"IF('Mother Calculator'!F18=\"Y\",1,0)","v":0},1,1,1,0,0,0,1,0.84011627906976738,0.5513565891472868,25.20348837209302,16.540697674418603,0,0,0,0,{"$f":"IF('Mother Calculator'!F18=\"Y\",K14*O14,0)","v":0},0,{"$error":"#DIV/0!"},{"$f":"IF('Mother Calculator'!$O$21=\"\",$H$3*100,'Mother Calculator'!$O$21)","v":100},0,0,0,0,0,0,null,null,null,27.420000000000005,0,0,0]
[null,7,null,{"$f":"IF('Mother Calculator'!F19=\"Y\",1,0)","v":0},1,1,1,0,0,0,1,0.7897286821705426,0.40406976744186046,23.691860465116278,12.122093023255815,0,0,0,0,{"$f":"IF('Mother Calculator'!F19=\"Y\",K15*O15,0)","v":0},0,{"$error":"#DIV/0!"},{"$f":"IF('Mother Calculator'!$O$21=\"\",$H$3*100,'Mother Calculator'!$O$21)","v":100},0,0,0,0,0,0,null,null,null,27.420000000000005,0,0,0]
[null,8,null,{"$f":"IF('Mother Calculator'!F20=\"Y\",1,0)","v":0},1,1,1,0,0,0,1,0.86240310077519378,0.48158914728682167,25.872093023255815,14.447674418604651,0,0,0,0,{"$f":"IF('Mother Calculator'!F20=\"Y\",K16*O16,0)","v":0},0,{"$error":"#DIV/0!"},{"$f":"IF('Mother Calculator'!$O$21=\"\",$H$3*100,'Mother Calculator'!$O$21)","v":100},0,0,0,0,0,0,null,null,null,27.420000000000005,0,0,0]
[null,9,null,{"$f":"IF('Mother Calculator'!F21=\"Y\",1,0)","v":0},1,1,1,0,0,0,1,null,0.66957364341085268,0,20.087209302325579,0,0,0,0,{"$f":"IF('Mother Calculator'!F21=\"Y\",K17*O17,0)","v":0},0,{"$error":"#DIV/0!"},{"$f":"IF('Mother Calculator'!$O$21=\"\",$H$3*100,'Mother Calculator'!$O$21)","v":100},0,0,0,0,0,0,null,null,null,27.420000000000005,0,0,0]
[null,10,null,{"$f":"IF('Mother Calculator'!F22=\"Y\",1,0)","v":0},1,1,1,0,0,0,1,0.88178294573643412,0.5,26.453488372093023,15,0,0,0,0,{"$f":"IF('Mother Calculator'!F22=\"Y\",K18*O18,0)","v":0},0,{"$error":"#DIV/0!"},{"$f":"IF('Mother Calculator'!$O$21=\"\",$H$3*100,'Mother Calculator'!$O$21)","v":100},0,0,0,0,0,0,null,null,null,27.420000000000005,0,0,0]
[null,11,null,{"$f":"IF('Mother Calculator'!F23=\"Y\",1,0)","v":0},1,1,1,0,0,0,1,null,0.48158914728682167,0,14.447674418604651,0,0,0,0,{"$f":"IF('Mother Calculator'!F23=\"Y\",K19*O19,0)","v":0},0,{"$error":"#DIV/0!"},{"$f":"IF('Mother Calculator'!$O$21=\"\",$H$3*100,'Mother Calculator'!$O$21)","v":100},0,0,0,0,0,0,null,null,null,27.420000000000005,0,0,0]
[null,12,null,{"$f":"IF('Mother Calculator'!H12=\"Y\",1,0)","v":0},1,1,1,0,0,0,1,null,0.372,0,11.16,0,0,0,0,{"$f":"IF('Mother Calculator'!H12=\"Y\",K20*O20,0)","v":0},0,{"$error":"#DIV/0!"},{"$f":"IF('Mother Calculator'!$O$21=\"\",$H$3*100,'Mother Calculator'!$O$21)","v":100},0,0,0,0,0,0,null,null,null,27.420000000000005,0,0,0]
[null,13,null,{"$f":"IF('Mother Calculator'!H13=\"Y\",1,0)","v":0},1,1,1,0,0,0,1,null,0.372,0,11.16,0,0,0,0,{"$f":"IF('Mother Calculator'!H13=\"Y\",K21*O21,0)","v":0},0,{"$error":"#DIV/0!"},{"$f":"IF('Mother Calculator'!$O$21=\"\",$H$3*100,'Mother Calculator'!$O$21)","v":100},0,0,0,0,0,0,null,null,null,27.420000000000005,0,0,0]
[null,14,null,{"$f":"IF('Mother Calculator'!H14=\"Y\",1,0)","v":0},1,1,1,0,0,0,1,null,0.372,0,11.16,0,0,0,0,{"$f":"IF('Mother Calculator'!H14=\"Y\",K22*O22,0)","v":0},0,{"$error":"#DIV/0!"},{"$f":"IF('Mother Calculator'!$O$21=\"\",$H$3*100,'Mother Calculator'!$O$21)","v":100},0,0,0,0,0,0,null,null,null,27.420000000000005,0,0,0]
[null,15,null,{"$f":"IF('Mother Calculator'!H15=\"Y\",1,0)","v":0},1,1,1,0,0,0,1,null,0.372,0,11.16,0,0,0,0,{"$f":"IF('Mother Calculator'!H15=\"Y\",K23*O23,0)","v":0},0,{"$error":"#DIV/0!"},{"$f":"IF('Mother Calculator'!$O$21=\"\",$H$3*100,'Mother Calculator'!$O$21)","v":100},0,0,0,0,0,0,null,null,null,27.420000000000005,0,0,0]
[null,16,null,{"$f":"IF('Mother Calculator'!H16=\"Y\",1,0)","v":0},1,1,1,0,0,0,1,null,0.372,0,11.16,0,0,0,0,{"$f":"IF('Mother Calculator'!H16=\"Y\",K24*O24,0)","v":0},0,{"$error":"#DIV/0!"},{"$f":"IF('Mother Calculator'!$O$21=\"\",$H$3*100,'Mother Calculator'!$O$21)","v":100},0,0,0,0,0,0,null,null,null,27.420000000000005,0,0,0]
[null,17,null,{"$f":"IF('Mother Calculator'!H17=\"Y\",1,0)","v":0},1,1,1,0,0,0,1,null,0.372,0,11.16,0,0,0,0,{"$f":"IF('Mother Calculator'!H17=\"Y\",K25*O25,0)","v":0},0,{"$error":"#DIV/0!"},{"$f":"IF('Mother Calculator'!$O$21=\"\",$H$3*100,'Mother Calculator'!$O$21)","v":100},0,0,0,0,0,0,null,null,null,27.420000000000005,0,0,0]
[null,18,null,{"$f":"IF('Mother Calculator'!H18=\"Y\",1,0)","v":0},1,1,1,0,0,0,1,null,0.372,0,11.16,0,0,0,0,{"$f":"IF('Mother Calculator'!H18=\"Y\",K26*O26,0)","v":0},0,{"$error":"#DIV/0!"},{"$f":"IF('Mother Calculator'!$O$21=\"\",$H$3*100,'Mother Calculator'!$O$21)","v":100},0,0,0,0,0,0,null,null,null,27.420000000000005,0,0,0]
[null,19,null,{"$f":"IF('Mother Calculator'!H19=\"Y\",1,0)","v":0},1,1,1,0,0,0,1,null,0.372,0,11.16,0,0,0,0,{"$f":"IF('Mother Calculator'!H19=\"Y\",K27*O27,0)","v":0},0,{"$error":"#DIV/0!"},{"$f":"IF('Mother Calculator'!$O$21=\"\",$H$3*100,'Mother Calculator'!$O$21)","v":100},0,0,0,0,0,0,null,null,null,27.420000000000005,0,0,0]
[null,20,null,{"$f":"IF('Mother Calculator'!H20=\"Y\",1,0)","v":0},1,1,1,0,0,0,1,null,0.372,0,11.16,0,0,0,0,{"$f":"IF('Mother Calculator'!H20=\"Y\",K28*O28,0)","v":0},0,{"$error":"#DIV/0!"},{"$f":"IF('Mother Calculator'!$O$21=\"\",$H$3*100,'Mother Calculator'!$O$21)","v":100},0,0,0,0,0,0,null,null,null,27.420000000000005,0,0,0]
[null,21,null,{"$f":"IF('Mother Calculator'!H21=\"Y\",1,0)","v":0},1,1,1,0,0,0,1,null,0.372,0,11.16,0,0,0,0,{"$f":"IF('Mother Calculator'!H21=\"Y\",K29*O29,0)","v":0},0,{"$error":"#DIV/0!"},{"$f":"IF('Mother Calculator'!$O$21=\"\",$H$3*100,'Mother Calculator'!$O$21)","v":100},0,0,0,0,0,0,null,null,null,27.420000000000005,0,0,0]
[null,22,null,{"$f":"IF('Mother Calculator'!H22=\"Y\",1,0)","v":0},1,1,1,0,0,0,1,null,0.372,0,11.16,0,0,0,0,{"$f":"IF('Mother Calculator'!H22=\"Y\",K30*O30,0)","v":0},0,{"$error":"#DIV/0!"},{"$f":"IF('Mother Calculator'!$O$21=\"\",$H$3*100,'Mother Calculator'!$O$21)","v":100},0,0,0,0,0,0,null,null,null,27.420000000000005,0,0,0]
[null,23,null,{"$f":"IF('Mother Calculator'!H23=\"Y\",1,0)","v":0},1,1,1,0,{"$f":"G31*D31","v":0},0,1,null,0.372,0,11.16,0,0,0,0,{"$f":"IF('Mother Calculator'!H23=\"Y\",K31*O31,0)","v":0},0,{"$error":"#DIV/0!"},{"$f":"IF('Mother Calculator'!$O$21=\"\",$H$3*100,'Mother Calculator'!$O$21)","v":100},0,0,0,0,0,0,null,null,null,27.420000000000005,0,0,0]
[null,24,null,{"$f":"IF('Mother Calculator'!J12=\"Y\",1,0)","v":0},1,1,1,0,0,0,1,null,0.24,0,7.1999999999999993,0,0,0,0,{"$f":"IF('Mother Calculator'!J12=\"Y\",K32*O32,0)","v":0},0,{"$error":"#DIV/0!"},{"$f":"IF('Mother Calculator'!$O$21=\"\",$H$3*100,'Mother Calculator'!$O$21)","v":100},0,0,0,0,0,0,null,null,null,27.420000000000005,0,0,0]
[null,25,null,{"$f":"IF('Mother Calculator'!J13=\"Y\",1,0)","v":0},1,1,1,{"$f":"G33*C33","v":0},0,0,1,null,0.24,0,7.1999999999999993,0,0,0,0,{"$f":"IF('Mother Calculator'!J13=\"Y\",K33*O33,0)","v":0},0,{"$error":"#DIV/0!"},{"$f":"IF('Mother Calculator'!$O$21=\"\",$H$3*100,'Mother Calculator'!$O$21)","v":100},0,0,0,0,0,0,null,null,null,27.420000000000005,0,0,0]
[null,26,null,{"$f":"IF('Mother Calculator'!J14=\"Y\",1,0)","v":0},1,1,1,0,0,0,1,null,0.24,0,7.1999999999999993,0,0,0,0,{"$f":"IF('Mother Calculator'!J14=\"Y\",K34*O34,0)","v":0},0,{"$error":"#DIV/0!"},{"$f":"IF('Mother Calculator'!$O$21=\"\",$H$3*100,'Mother Calculator'!$O$21)","v":100},0,0,0,0,0,0,null,null,null,27.420000000000005,0,0,0]
[null,27,null,{"$f":"IF('Mother Calculator'!J15=\"Y\",1,0)","v":0},1,1,1,0,0,0,1,null,0.24,0,7.1999999999999993,0,0,0,0,{"$f":"IF('Mother Calculator'!J15=\"Y\",K35*O35,0)","v":0},0,{"$error":"#DIV/0!"},{"$f":"IF('Mother Calculator'!$O$21=\"\",$H$3*100,'Mother Calculator'!$O$21)","v":100},0,0,0,0,0,0,null,null,null,27.420000000000005,0,0,0]
[null,28,null,{"$f":"IF('Mother Calculator'!J16=\"Y\",1,0)","v":0},1,1,1,0,0,0,1,null,0.24,0,7.1999999999999993,0,0,0,0,{"$f":"IF('Mother Calculator'!J16=\"Y\",K36*O36,0)","v":0},0,{"$error":"#DIV/0!"},{"$f":"IF('Mother Calculator'!$O$21=\"\",$H$3*100,'Mother Calculator'!$O$21)","v":100},0,0,0,0,0,0,null,null,null,27.420000000000005,0,0,0]
[null,29,null,{"$f":"IF('Mother Calculator'!J17=\"Y\",1,0)","v":0},1,1,1,0,0,0,1,null,0.24,0,7.1999999999999993,0,0,0,0,{"$f":"IF('Mother Calculator'!J17=\"Y\",K37*O37,0)","v":0},0,{"$error":"#DIV/0!"},{"$f":"IF('Mother Calculator'!$O$21=\"\",$H$3*100,'Mother Calculator'!$O$21)","v":100},0,0,0,0,0,0,null,null,null,27.420000000000005,0,0,0]
[null,30,null,{"$f":"IF('Mother Calculator'!J18=\"Y\",1,0)","v":0},1,1,1,0,0,0,1,null,0.24,0,7.1999999999999993,0,0,0,0,{"$f":"IF('Mother Calculator'!J18=\"Y\",K38*O38,0)","v":0},0,{"$error":"#DIV/0!"},{"$f":"IF('Mother Calculator'!$O$21=\"\",$H$3*100,'Mother Calculator'!$O$21)","v":100},0,0,0,0,0,0,null,null,null,27.420000000000005,0,0,0]
[null,31,null,{"$f":"IF('Mother Calculator'!J19=\"Y\",1,0)","v":0},1,1,1,0,0,0,1,null,0.24,0,7.1999999999999993,0,0,0,0,{"$f":"IF('Mother Calculator'!J19=\"Y\",K39*O39,0)","v":0},0,{"$error":"#DIV/0!"},{"$f":"IF('Mother Calculator'!$O$21=\"\",$H$3*100,'Mother Calculator'!$O$21)","v":100},0,0,0,0,0,0,null,null,null,27.420000000000005,0,0,0]
[null,32,null,{"$f":"IF('Mother Calculator'!J20=\"Y\",1,0)","v":0},1,1,1,0,0,{"$f":"I40*E40","v":0},1,null,0.24,0,7.1999999999999993,0,0,0,0,{"$f":"IF('Mother Calculator'!J20=\"Y\",K40*O40,0)","v":0},0,{"$error":"#DIV/0!"},{"$f":"IF('Mother Calculator'!$O$21=\"\",$H$3*100,'Mother Calculator'!$O$21)","v":100},0,0,0,0,0,0,null,null,null,27.420000000000005,0,0,0]
[null,33,null,{"$f":"IF('Mother Calculator'!J21=\"Y\",1,0)","v":0},1,1,1,0,0,0,1,null,0.24,0,7.1999999999999993,0,0,0,0,{"$f":"IF('Mother Calculator'!J21=\"Y\",K41*O41,0)","v":0},0,{"$error":"#DIV/0!"},{"$f":"IF('Mother Calculator'!$O$21=\"\",$H$3*100,'Mother Calculator'!$O$21)","v":100},0,0,0,0,0,0,null,null,null,27.420000000000005,0,0,0]
[null,34,null,{"$f":"IF('Mother Calculator'!J22=\"Y\",1,0)","v":0},1,1,1,0,0,0,1,null,0.24,0,7.1999999999999993,0,0,0,0,{"$f":"IF('Mother Calculator'!J22=\"Y\",K42*O42,0)","v":0},0,{"$error":"#DIV/0!"},{"$f":"IF('Mother Calculator'!$O$21=\"\",$H$3*100,'Mother Calculator'!$O$21)","v":100},0,0,0,0,0,0,null,null,null,27.420000000000005,0,0,0]
[null,35,null,{"$f":"IF('Mother Calculator'!J23=\"Y\",1,0)","v":0},1,1,1,0,0,0,1,null,0.24,0,7.1999999999999993,0,0,0,0,{"$f":"IF('Mother Calculator'!J23=\"Y\",K43*O43,0)","v":0},0,{"$error":"#DIV/0!"},{"$f":"IF('Mother Calculator'!$O$21=\"\",$H$3*100,'Mother Calculator'!$O$21)","v":100},0,0,0,0,0,0,null,null,null,27.420000000000005,0,0,0]
[]
[null,null,null,null,null,null,null,null,null,null,null,null,null,null,null,null,null,{"$f":"SUM(R8:R43)","v":0},{"$f":"SUM(S8:S43)","v":0},{"$f":"SUM(T8:T43)","v":0},{"$f":"SUM(U8:U43)","v":0},{"$f":"U45/T45","v":{"$error":"#DIV/0!"}},null,{"$f":"SUM(X8:X43)","v":0},0,0,0,0,0,null,null,null,null,{"$f":"SUM(AH9:AH43)","v":0},{"$f":"SUM(AI9:AI43)","v":0},{"$f":"SUM(AJ9:AJ43)","v":0}]
[]
[null,null,null,null,null,null,null,null,null,null,null,null,null,null,null,null,null,null,null,null,null,null,null,"0-11","0-12","0-13","0-14","0-15","0-16"]
[null,null,null,null,null,null,null,null,null,null,null,null,null,null,null,null,null,null,null,null,null,null,null,"12-23","12-24","12-25","12-26","12-27","12-28"]
[null,null,null,null,null,null,null,null,null,null,null,null,null,null,null,null,null,null,null,null,null,null,null,"24-35","24-36","24-37","24-38","24-39","24-40"]
[]
[null,null,null,null,null,null,null,null,null,null,null,null,null,null,null,null,"0-11",{"$f":"SUM(R8:R19)","v":0},{"$f":"SUM(S8:S19)","v":0},{"$f":"SUM(T8:T19)","v":0},{"$f":"SUM(U8:U19)","v":0},{"$f":"U51/T51","v":{"$error":"#DIV/0!"}},null,{"$f":"SUM(X8:X19)","v":0},0,0,0,0,0]
[null,null,null,null,null,null,null,null,null,null,null,null,null,null,null,null,"12-23",{"$f":"SUM(R20:R31)","v":0},{"$f":"SUM(S20:S31)","v":0},{"$f":"SUM(T20:T31)","v":0},{"$f":"SUM(U20:U31)","v":0},{"$f":"U52/T52","v":{"$error":"#DIV/0!"}},null,{"$f":"SUM(X20:X31)","v":0},0,0,0,0,0]
[null,null,null,null,null,null,null,null,null,null,null,null,null,null,null,null,"24-35",{"$f":"SUM(R32:R43)","v":0},{"$f":"SUM(S32:S43)","v":0},{"$f":"SUM(T32:T43)","v":0},{"$f":"SUM(U32:U43)","v":0},{"$error":"#DIV/0!"},null,{"$f":"SUM(X32:X43)","v":0},0,0,0,0,0]
[null,null,null,null,null,null,null,null,null,null,null,null,null,null,null,null,null,{"$f":"SUM(R51:R53)","v":0},{"$f":"SUM(S51:S53)","v":0},0,0,{"$error":"#DIV/0!"},null,{"$f":"SUM(X51:X53)","v":0},{"$f":"SUM(Y51:Y53)","v":0},0,0,0,{"$f":"SUM(AC51:AC53)","v":0}]
[]
[null,null,null,null,null,null,null,null,null,null,null,null,null,null,null,null,"0-5",{"$f":"SUM(R8:R13)","v":0},{"$f":"SUM(S8:S13)","v":0},{"$f":"SUM(T8:T13)","v":0},{"$f":"SUM(U8:U13)","v":0},{"$f":"U56/T56","v":{"$error":"#DIV/0!"}},null,{"$f":"SUM(X8:X13)","v":0},0,0,0,0,0]
[null,null,null,null,null,null,null,null,null,null,null,null,null,null,null,null,"6-23",{"$f":"SUM(R14:R31)","v":0},{"$f":"SUM(S14:S31)","v":0},{"$f":"SUM(T14:T31)","v":0},{"$f":"SUM(U14:U31)","v":0},{"$error":"#DIV/0!"},null,{"$f":"SUM(X14:X31)","v":0},0,0,0,0,0]
[null,null,null,null,null,null,null,null,null,null,null,null,null,null,null,null,null,{"$f":"SUM(R56:R57)","v":0},{"$f":"SUM(S56:S57)","v":0},0,0,{"$error":"#DIV/0!"},null,{"$f":"SUM(X56:X57)","v":0},{"$f":"SUM(Y56:Y57)","v":0},0,0,0,0]
[null,null,null,null,null,null,null,null,null,null,null,null,null,null,null,null,"*RTU, XYZ, AA, AAB , AAC"]

{"sheet":"Country Data","index":12,"n_rows":46,"n_cols":30,"rows_kept":46,"cut":false,"hidden":true,"merged":[[35,1,35,2],[2,5,2,7],[8,16,9,16],[8,11,9,11],[8,12,9,12],[8,13,9,13],[8,14,9,14],[8,15,9,15],[23,5,26,7],[23,11,26,16],[6,5,6,7]]}
[null,"Mothers' Milk Tool"]
[null,"Country breastfeeding rate"]
[]
[]
[]
[]
[null,null,null,null,null,{"$f":"INDEX(Database!B2:B232,Database!G2)","v":"Iraq"}]
[null,null,null,null,null,"ISO code:",{"$f":"INDEX(Database!H2:H232,Database!G2)","v":"IRQ"}]
[null,null,null,null,null,"Region:",{"$f":"INDEX(Database!K2:K233,Database!G2)","v":"Middle East and North Africa"},null,null,null,null,"Month","Rate","Month","Rate","Month","Rate"]
[null,null,null,null,null,"Income class:",{"$f":"INDEX(Database!N2:N233,Database!G2)","v":"Upper-Middle-Income"}]
[null,null,null,null,null,null,null,null,null,null,null,"0 < 1",{"$f":"'BF computation'!B5","v":0.96296296296296291},"12 < 13",{"$f":"'BF computation'!B17","v":0.592741935483871},"24 < 25",{"$f":"'BF computation'!B29","v":0.13247863247863248}]
[null,null,null,null,null,null,null,null,null,null,null,"1 < 2",{"$f":"'BF computation'!B6","v":0.90476190476190477},"13 <14",{"$f":"'BF computation'!B18","v":0.50813008130081305},"25 < 26",{"$f":"'BF computation'!B30","v":0.10820895522388059}]
[null,null,null,null,null,"Data collection year:",{"$f":"IF(G35=0,INDEX(Database!Q2:Q233,Database!G2),\"\")","v":"2018"},null,null,null,null,"2 < 3",{"$f":"'BF computation'!B7","v":0.88235294117647056},"14 < 15",{"$f":"'BF computation'!B19","v":0.48375451263537905},"26 < 27",{"$f":"'BF computation'!B31","v":0.12878787878787878}]
[null,null,null,null,null,"Data source:",{"$f":"IF(G35=0,INDEX(Database!O2:O233,Database!G2), \"Generated\")","v":"Full data, Source: MICS"},null,null,null,null,"3 < 4",{"$f":"'BF computation'!B8","v":0.82954545454545459},"15 < 16",{"$f":"'BF computation'!B20","v":0.47058823529411764},"27 < 28",{"$f":"'BF computation'!B32","v":0.10756972111553785}]
[null,null,null,null,null,null,null,null,null,null,null,"4 < 5",{"$f":"'BF computation'!B9","v":0.70397111913357402},"16 < 17",{"$f":"'BF computation'!B21","v":0.4765625},"28 < 29",{"$f":"'BF computation'!B33","v":9.012875536480687E-2}]
[null,null,null,null,null,"No. of livebirths:",1037000,null,null,null,null,"5 < 6",{"$f":"'BF computation'!B10","v":0.70110701107011075},"17 < 18",{"$f":"'BF computation'!B22","v":0.42537313432835822},"29 < 30",{"$f":"'BF computation'!B34","v":7.8703703703703706E-2}]
[null,null,null,null,null,"Year:",2020,null,null,null,null,"6 < 7",{"$f":"'BF computation'!B11","v":0.70188679245283014},"18 < 19",{"$f":"'BF computation'!B23","v":0.32954545454545453},"30 < 31",{"$f":"'BF computation'!B35","v":9.7560975609756101E-2}]
[null,null,null,null,null,null,null,null,null,null,null,"7 < 8",{"$f":"'BF computation'!B12","v":0.65600000000000003},"19 < 20",{"$f":"'BF computation'!B24","v":0.35897435897435898},"31 < 32",{"$f":"'BF computation'!B36","v":9.6385542168674704E-2}]
[null,null,null,null,null,"Currency:",{"$f":"IF(G36=1, \"#N/A\", INDEX(Database!C2:C233,Database!G2))","v":"Iraqi Dinar                             "},null,null,null,null,"8 < 9",{"$f":"'BF computation'!B13","v":0.65182186234817818},"20 < 21",{"$f":"'BF computation'!B25","v":0.34024896265560167},"32 < 33",{"$f":"'BF computation'!B37","v":6.569343065693431E-2}]
[null,null,null,null,null,"Exchange rate US$ 1:",1450,null,null,null,null,"9 < 10",{"$f":"'BF computation'!B14","v":0.58608058608058611},"21 < 22",{"$f":"'BF computation'!B26","v":0.32773109243697479},"33 < 34",{"$f":"'BF computation'!B38","v":7.9831932773109238E-2},null,null,null,null,null,null,null,null,null,null,null,null,{"$f":"Country!H8","v":"Iraq"}]
[null,null,null,null,null,"Currency code:",{"$f":"IF(G36=1, \"#N/A\", INDEX(Database!D2:D233,Database!G2))","v":"IQD"},null,null,null,null,"10 < 11",{"$f":"'BF computation'!B15","v":0.63184079601990051},"22 < 23",{"$f":"'BF computation'!B27","v":0.28828828828828829},"34 < 35",{"$f":"'BF computation'!B39","v":7.5892857142857137E-2}]
[null,null,null,null,null,"Currency rate date:","2021-01-10",null,null,null,null,"11 < 12",{"$f":"'BF computation'!B16","v":0.68663594470046085},"23 < 24",{"$f":"'BF computation'!B28","v":0.24352331606217617},"35 < 36",{"$f":"'BF computation'!B40","v":""}]
[]
[null,null,null,null,null,null,null,null,null,null,null,"If you decide not to impute the missing data, the calculation of production and value will be limited to available data."]
[]
[]
[]
[]
[]
[null,null,null,null,null,null,{"$f":"IF(F7=\"\", \"\", INDEX(Database!AP2:AP233,Database!G2)*1000)","v":1037000},null,null,null,null,null,"IF(G7=\"\", \"\", INDEX(Database!AP2:AP233,Database!G2)*1000)"]
[null,null,null,null,null,null,{"$f":"IF(F7=\"\", \"\", 2020)","v":2020},null,null,null,null,null,"IF(G7=\"\", \"\", INDEX(Database!F2:F233,Database!G2))"]
[null,null,null,null,null,null,{"$f":"IF(F7=\"\", \"\", INDEX(Database!F2:F233,Database!G2))","v":1450},null,null,null,null,null,"IF(G36=1, \"#N/A\", INDEX(Database!C2:C233,Database!G2))"]
[null,null,null,null,null,null,{"$f":"IF(F7=\"\", \"\", TEXT(INDEX(Database!E2:E232,Database!G2),\"d/m/yyyy\"))","v":"1/10/2021"},null,null,null,null,null,"IF(G36=1, \"#N/A\", INDEX(Database!D2:D233,Database!G2))"]
[null,null,null,null,null,null,null,null,null,null,null,null,"IF(G7=\"\", \"\", TEXT(INDEX(Database!E2:E232,Database!G2),\"d/m/yyyy\"))"]
[null,null,null,null,null,null,0,"Flag for BF entries"]
[null,{"$f":"AD20","v":"Iraq"},null,null,null,null,0,"Flag for New Country"]
[null,null,null,null,null,null,0,"FlagEntry "]
[]
[null,null,null,null,null,null,{"$f":"IF(G30=\"\", \"\", INDEX(Database!AP25:AP256,Database!G25)*1000)","v":402000}]
[null,null,null,null,null,null,{"$f":"IF(G30=\"\", \"\", 2020)","v":2020}]
[]
[]
[null,null,null,null,null,null,{"$f":"IF(G60=1, \"#N/A\", INDEX(Database!C26:C257,Database!G26))","v":"Jersey Pound"}]
[null,null,null,null,null,null,{"$f":"IF(G31=\"\", \"\", INDEX(Database!F26:F257,Database!G26))","v":803}]
[null,null,null,null,null,null,{"$f":"IF(G60=1, \"#N/A\", INDEX(Database!D26:D257,Database!G26))","v":"CNY"}]
[null,null,null,null,null,null,{"$f":"IF(G31=\"\", \"\", TEXT(INDEX(Database!E26:E256,Database!G26),\"d/m/yyyy\"))","v":"1/10/2021"}]

{"sheet":"Data Entry","index":13,"n_rows":37,"n_cols":54,"rows_kept":37,"cut":false,"hidden":true,"merged":[[4,13,4,18],[6,13,6,18],[7,2,7,8]]}
[null,"Mothers'  Milk Tool"]
[null,"Data entry"]
[]
[]
[null,null,null,null,null,null,null,null,null,null,null,null,null,"Enter own breastfeeding rate"]
[]
[null,null,null,null,null,null,{"$f":"N7","v":"Iraq"},null,null,null,null,null,null,{"$f":"Country2","v":"Iraq"}]
[null,null,{"$f":"N7","v":"Iraq"},null,null,null,null,null,null,null,"Enter your own data",null,null,"Month","Rate","Month","Rate","Month","Rate"]
[null,null,{"$f":"'Country Data'!F16","v":"No. of livebirths:"},null,null,null,1037000,null,null,null,null,null,null,"0 < 1",null,"12 < 13",null,"24 < 25"]
[null,null,"Year recorded:",null,null,null,2020,null,null,null,null,null,null,"1 < 2",null,"13 <14",null,"25 < 26"]
[null,null,null,null,null,null,null,null,null,null,null,null,null,"2 < 3",null,"14 < 15",null,"26 < 27"]
[null,null,{"$f":"'Country Data'!F19","v":"Currency:"},null,null,null,{"$f":"'Country Data'!Currency","v":"Iraqi Dinar                             "},null,null,null,null,null,null,"3 < 4",null,"15 < 16",null,"27 < 28"]
[null,null,{"$f":"'Country Data'!F20","v":"Exchange rate US$ 1:"},null,null,null,1450,null,null,null,null,null,null,"4 < 5",null,"16 < 17",null,"28 < 29"]
[null,null,{"$f":"'Country Data'!F22","v":"Currency rate date:"},null,null,null,"2021-01-10",null,null,null,"dd/mm/yyyy",null,null,"5 < 6",null,"17 < 18",null,"29 < 30"]
[null,null,null,null,null,null,null,null,null,null,null,null,null,"6 < 7",null,"18 < 19",null,"30 < 31"]
[null,null,null,null,null,null,null,null,null,null,null,null,null,"7 < 8",null,"19 < 20",null,"31 < 32"]
[null,null,"Price per liter of breastmilk in local currency",null,null,null,null,null,null,null,null,null,null,"8 < 9",null,"20 < 21",null,"32 < 33"]
[null,null,{"$f":"_xlfn.CONCAT(\"Default price per liter of breastmilk in \", TRIM(G12))","v":"Default price per liter of breastmilk in Iraqi Dinar"},null,null,null,null,null,null,null,{"$f":"G13*100","v":145000},null,null,"9 < 10",null,"21 < 22",null,"33 < 34"]
[null,null,null,null,null,null,null,null,null,null,null,null,null,"10 < 11",null,"22 < 23",null,"34 < 35"]
[null,null,null,null,null,null,null,null,null,null,null,null,null,"11 < 12",null,"23 < 24",null,"35 < 36",null,null,null,null,null,null,null,null,null,null,null,null,null,null,null,null,null,null,null,null,null,null,null,null,null,null,null,null,null,null,null,null,null,null,null,{"$f":"IF(K17<>\"\",K17/G13,100)","v":100}]
[]
[]
[]
[]
[]
[]
[]
[]
[]
[]
[]
[]
[]
[]
[]
[null,null,null,null,null,null,0]
[null,null,null,null,null,null,0]

{"sheet":"BF Rate Chart","index":14,"n_rows":21,"n_cols":7,"rows_kept":21,"cut":false,"hidden":true,"merged":[[6,1,7,6]]}
[null,"Mothers' Milk Tool"]
[null,"Breastfeeding chart"]
[]
[]
[]
[]
[null,{"$f":"'Country Data'!F7","v":"Iraq"}]
[]
[null,"Month","Rate","Month","Rate","Month","Rate"]
[null,"0 < 1",{"$f":"'BF computation'!B5","v":0.96296296296296291},"12 < 13",{"$f":"'BF computation'!B17","v":0.592741935483871},"24 < 25",{"$f":"'BF computation'!B29","v":0.13247863247863248}]
[null,"1 < 2",{"$f":"'BF computation'!B6","v":0.90476190476190477},"13 <14",{"$f":"'BF computation'!B18","v":0.50813008130081305},"25 < 26",{"$f":"'BF computation'!B30","v":0.10820895522388059}]
[null,"2 < 3",{"$f":"'BF computation'!B7","v":0.88235294117647056},"14 < 15",{"$f":"'BF computation'!B19","v":0.48375451263537905},"26 < 27",{"$f":"'BF computation'!B31","v":0.12878787878787878}]
[null,"3 < 4",{"$f":"'BF computation'!B8","v":0.82954545454545459},"15 < 16",{"$f":"'BF computation'!B20","v":0.47058823529411764},"27 < 28",{"$f":"'BF computation'!B32","v":0.10756972111553785}]
[null,"4 < 5",{"$f":"'BF computation'!B9","v":0.70397111913357402},"16 < 17",{"$f":"'BF computation'!B21","v":0.4765625},"28 < 29",{"$f":"'BF computation'!B33","v":9.012875536480687E-2}]
[null,"5 < 6",{"$f":"'BF computation'!B10","v":0.70110701107011075},"17 < 18",{"$f":"'BF computation'!B22","v":0.42537313432835822},"29 < 30",{"$f":"'BF computation'!B34","v":7.8703703703703706E-2}]
[null,"6 < 7",{"$f":"'BF computation'!B11","v":0.70188679245283014},"18 < 19",{"$f":"'BF computation'!B23","v":0.32954545454545453},"30 < 31",{"$f":"'BF computation'!B35","v":9.7560975609756101E-2}]
[null,"7 < 8",{"$f":"'BF computation'!B12","v":0.65600000000000003},"19 < 20",{"$f":"'BF computation'!B24","v":0.35897435897435898},"31 < 32",{"$f":"'BF computation'!B36","v":9.6385542168674704E-2}]
[null,"8 < 9",{"$f":"'BF computation'!B13","v":0.65182186234817818},"20 < 21",{"$f":"'BF computation'!B25","v":0.34024896265560167},"32 < 33",{"$f":"'BF computation'!B37","v":6.569343065693431E-2}]
[null,"9 < 10",{"$f":"'BF computation'!B14","v":0.58608058608058611},"21 < 22",{"$f":"'BF computation'!B26","v":0.32773109243697479},"33 < 34",{"$f":"'BF computation'!B38","v":7.9831932773109238E-2}]
[null,"10 < 11",{"$f":"'BF computation'!B15","v":0.63184079601990051},"22 < 23",{"$f":"'BF computation'!B27","v":0.28828828828828829},"34 < 35",{"$f":"'BF computation'!B39","v":7.5892857142857137E-2}]
[null,"11 < 12",{"$f":"'BF computation'!B16","v":0.68663594470046085},"23 < 124",{"$f":"'BF computation'!B28","v":0.24352331606217617},"35 < 36",{"$f":"'BF computation'!B40","v":""}]

{"sheet":"Result-Lost Milk Estimate","index":15,"n_rows":84,"n_cols":7,"rows_kept":84,"cut":false,"hidden":true,"merged":[[2,6,5,9],[5,1,6,4]]}
[null,null,"Mothers' Milk Tool"]
[null,null,"Country production and value"]
[]
[]
[]
[null,"*The calculation in the tables shows the totals based on the data entries for breastfeeding"]
[]
[]
[null,null,{"$f":"Country2","v":"Iraq"}]
[]
[null,null,"Total for 3 years","Volume","Value ","Value"]
[null,null,{"$f":"CONCATENATE(\"(Estimate for \",'BF computation'!C5,\" data entries)\")","v":"(Estimate for 35 data entries)"}," in million liters ","in million USD",{"$f":"CONCATENATE(\"in million \",Currency)","v":"in million Iraqi Dinar                             "}]
[null,null,"1. Actual annual production of breastmilk ",{"$f":"'Calibration Matrix '!R45","v":228.14589068990446},{"$f":"'Calibration Matrix '!X45","v":22814.589068990445},{"$f":"'Calibration Matrix '!AA45","v":33081154.150036156}]
[null,null,"2. Potential production of breastmilk",{"$f":"'Calibration Matrix '!T45","v":430.79757713023253},{"$f":"'Calibration Matrix '!Y45","v":43079.757713023224},{"$f":"'Calibration Matrix '!AB45","v":62465648.68388366}]
[null,null,"3. Lost breastmilk",{"$f":"'Calibration Matrix '!U45","v":202.65168644032806},{"$f":"'Calibration Matrix '!Z45","v":20265.168644032809},{"$f":"'Calibration Matrix '!AC45","v":29384494.533847567}]
[null,null,"4. Percent lost",{"$f":"D15/D14","v":0.47041046003623488}]
[]
[null,null,{"$f":"'Country Data'!F20","v":"Exchange rate US$ 1:"},{"$f":"'Country Data'!$G$20 & \" \" & Currency","v":"1450 Iraqi Dinar                             "}]
[null,null,{"$f":"'Country Data'!F14","v":"Data source:"},{"$f":"'Country Data'!Source","v":"Full data, Source: MICS"}]
[]
[]
[null,null,{"$f":"Country2","v":"Iraq"}]
[]
[null,null,"Total for 0 to <6 months","Volume","Value ","Value"]
[null,null,{"$f":"CONCATENATE(\"(Estimate for \",'BF computation'!C9,\" data entries)\")","v":"(Estimate for 6 data entries)"}," in million liters ","in million USD",{"$f":"CONCATENATE(\"in million \",Currency)","v":"in million Iraqi Dinar                             "}]
[null,null,"1. Actual annual production of breastmilk ",{"$f":"'Calibration Matrix '!R56","v":101.7708197753803},{"$f":"'Calibration Matrix '!X56","v":10177.081977538031},{"$f":"'Calibration Matrix '!AA56","v":14756768.867430143}]
[null,null,"2. Potential production of breastmilk",{"$f":"'Calibration Matrix '!T56","v":120.06048372093024},{"$f":"'Calibration Matrix '!Y56","v":12006.048372093024},{"$f":"'Calibration Matrix '!AB56","v":17408770.139534887}]
[null,null,"3. Lost breastmilk",{"$f":"'Calibration Matrix '!U56","v":18.289663945549925},{"$f":"'Calibration Matrix '!Z56","v":1828.9663945549926},{"$f":"'Calibration Matrix '!AC56","v":2652001.2721047397}]
[null,null,"4. Percent lost",{"$f":"D28/D27","v":0.15233708359915157}]
[]
[null,null,{"$f":"'Country Data'!F20","v":"Exchange rate US$ 1:"},{"$f":"'Country Data'!$G$20 & \" \" & Currency","v":"1450 Iraqi Dinar                             "}]
[null,null,{"$f":"'Country Data'!F14","v":"Data source:"},{"$f":"'Country Data'!Source","v":"Full data, Source: MICS"}]
[]
[]
[null,null,{"$f":"Country2","v":"Iraq"}]
[null,null,null,null,null,null,0]
[null,null,"Total for 6 to <24 months","Volume","Value ","Value",0]
[null,null,{"$f":"CONCATENATE(\"(Estimate for \",'BF computation'!C10,\" data entries)\")","v":"(Estimate for 18 data entries)"}," in million liters ","in million USD",{"$f":"CONCATENATE(\"in million \",Currency)","v":"in million Iraqi Dinar                             "}]
[null,null,"1. Actual annual production of breastmilk ",{"$f":"'Calibration Matrix '!R57","v":118.45141077096773},{"$f":"'Calibration Matrix '!X57","v":11845.141077096774},{"$f":"'Calibration Matrix '!AA57","v":17175454.561790321}]
[null,null,"2. Potential production of breastmilk",{"$f":"'Calibration Matrix '!T57","v":230.24930140930235},{"$f":"'Calibration Matrix '!Y57","v":23024.930140930235},{"$f":"'Calibration Matrix '!AB57","v":33386148.70434884}]
[null,null,"3. Lost breastmilk",{"$f":"'Calibration Matrix '!U57","v":111.79789063833456},{"$f":"'Calibration Matrix '!Z57","v":11179.789063833456},{"$f":"'Calibration Matrix '!AC57","v":16210694.142558513}]
[null,null,"4. Percent lost",{"$f":"D41/D40","v":0.48555148681905097}]
[]
[null,null,{"$f":"'Country Data'!F20","v":"Exchange rate US$ 1:"},{"$f":"'Country Data'!$G$20 & \" \" & Currency","v":"1450 Iraqi Dinar                             "}]
[null,null,{"$f":"'Country Data'!F14","v":"Data source:"},{"$f":"'Country Data'!Source","v":"Full data, Source: MICS"}]
[]
[]
[null,null,{"$f":"Country2","v":"Iraq"}]
[]
[null,null,"Total for 1st year","Volume","Value ","Value"]
[null,null,{"$f":"CONCATENATE(\"(Estimate for \",'BF computation'!C6,\" data entries)\")","v":"(Estimate for 12 data entries)"}," in million liters ","in million USD",{"$f":"CONCATENATE(\"in million \",Currency)","v":"in million Iraqi Dinar                             "}]
[null,null,"1. Actual annual production of breastmilk ",{"$f":"'Calibration Matrix '!R51","v":164.14608793857937},{"$f":"'Calibration Matrix '!X51","v":16414.608793857937},{"$f":"'Calibration Matrix '!AA51","v":23801182.751094013}]
[null,null,"2. Potential production of breastmilk",{"$f":"'Calibration Matrix '!T51","v":214.21224593023257},{"$f":"'Calibration Matrix '!Y51","v":21421.224593023257},{"$f":"'Calibration Matrix '!AB51","v":31060775.659883726}]
[null,null,"3. Lost breastmilk",{"$f":"'Calibration Matrix '!U51","v":50.066157991653171},{"$f":"'Calibration Matrix '!Z51","v":5006.6157991653172},{"$f":"'Calibration Matrix '!AC51","v":7259592.9087897101}]
[null,null,"4. Percent lost",{"$f":"D54/D53","v":0.23372220282849454}]
[]
[null,null,{"$f":"'Country Data'!F20","v":"Exchange rate US$ 1:"},{"$f":"'Country Data'!$G$20 & \" \" & Currency","v":"1450 Iraqi Dinar                             "}]
[null,null,{"$f":"'Country Data'!F14","v":"Data source:"},{"$f":"'Country Data'!Source","v":"Full data, Source: MICS"}]
[]
[]
[null,null,{"$f":"Country2","v":"Iraq"}]
[]
[null,null,"Total for 2nd year","Volume","Value ","Value"]
[null,null,{"$f":"CONCATENATE(\"(Estimate for \",'BF computation'!C7,\" data entries)\")","v":"(Estimate for 12 data entries)"}," in million liters ","in million USD",{"$f":"CONCATENATE(\"in million \",Currency)","v":"in million Iraqi Dinar                             "}]
[null,null,"1. Actual annual production of breastmilk ",{"$f":"'Calibration Matrix '!R52","v":56.076142607768659},{"$f":"'Calibration Matrix '!X52","v":5607.6142607768661},{"$f":"'Calibration Matrix '!AA52","v":8131040.6781264553}]
[null,null,"2. Potential production of breastmilk",{"$f":"'Calibration Matrix '!T52","v":136.0975392},{"$f":"'Calibration Matrix '!Y52","v":13609.753920000001},{"$f":"'Calibration Matrix '!AB52","v":19734143.183999997}]
[null,null,"3. Lost breastmilk",{"$f":"'Calibration Matrix '!U52","v":80.021396592231326},{"$f":"'Calibration Matrix '!Z52","v":8002.1396592231304},{"$f":"'Calibration Matrix '!AC52","v":11603102.505873542}]
[null,null,"4. Percent lost",{"$f":"D67/D66","v":0.58797092925124195}]
[]
[null,null,{"$f":"'Country Data'!F20","v":"Exchange rate US$ 1:"},{"$f":"'Country Data'!$G$20 & \" \" & Currency","v":"1450 Iraqi Dinar                             "}]
[null,null,{"$f":"'Country Data'!F14","v":"Data source:"},{"$f":"'Country Data'!Source","v":"Full data, Source: MICS"}]
[]
[]
[null,null,{"$f":"Country2","v":"Iraq"}]
[]
[null,null,"Total for 3rd year","Volume","Value ","Value"]
[null,null,{"$f":"CONCATENATE(\"(Estimate for \",'BF computation'!C8,\" data entries)\")","v":"(Estimate for 11 data entries)"}," in million Liters ","in million USD",{"$f":"CONCATENATE(\"in million \",Currency)","v":"in million Iraqi Dinar                             "}]
[null,null,"1. Actual annual production of breastmilk ",{"$f":"'Calibration Matrix '!R53","v":7.9236601435564218},{"$f":"'Calibration Matrix '!X53","v":792.36601435564216},{"$f":"'Calibration Matrix '!AA53","v":1148930.7208156812}]
[null,null,"2. Potential production of breastmilk",{"$f":"'Calibration Matrix '!T53","v":80.48779199999997},{"$f":"'Calibration Matrix '!Y53","v":8048.7791999999981},{"$f":"'Calibration Matrix '!AB53","v":11670729.839999996}]
[null,null,"3. Lost breastmilk",{"$f":"'Calibration Matrix '!U53","v":72.564131856443566},{"$f":"'Calibration Matrix '!Z53","v":7256.4131856443555},{"$f":"'Calibration Matrix '!AC53","v":10521799.119184317}]
[null,null,"4. Percent lost",{"$f":"D80/D79","v":0.90155450973786921}]
[]
[null,null,{"$f":"'Country Data'!F20","v":"Exchange rate US$ 1:"},{"$f":"'Country Data'!$G$20 & \" \" & Currency","v":"1450 Iraqi Dinar                             "}]
[null,null,{"$f":"'Country Data'!F14","v":"Data source:"},{"$f":"'Country Data'!Source","v":"Full data, Source: MICS"}]

{"sheet":"Results Compare","index":16,"n_rows":84,"n_cols":13,"rows_kept":84,"cut":false,"hidden":true,"merged":[[2,6,5,9],[5,1,6,5],[7,1,7,6],[7,8,7,13]]}
[null,"Mother's Milk Tool"]
[null,"Milk production and value estimates"]
[]
[]
[]
[null,"*The calculation in the tables shows the totals based on the data entries for breastfeeding"]
[]
[null,"Calculation using Estimator/own BF data",null,null,null,null,null,null,"Calculation using available BF data only"]
[null,{"$f":"Country2","v":"Iraq"},null,null,null,null,null,null,"Iraq"]
[]
[null,null,"TOTAL for 3 years*","Volume","Value ","Value",null,null,null,"TOTAL for 3 years*","Volume","Value ","Value"]
[null,null,{"$f":"CONCATENATE(\"(Estimate for \",'BF computation'!C5,\" Data Entries)\")","v":"(Estimate for 35 Data Entries)"}," in million Liters ","in million USD",{"$f":"CONCATENATE(\"in million \",Currency)","v":"in million Iraqi Dinar                             "},null,null,null,"(Estimate for 35 Data Entries)"," in million Liters ","in million USD","in million Iraqi Dinar                             "]
[null,null,"1. Actual production of Breastmilk ",{"$f":"'Calibration Matrix '!R45","v":228.14589068990446},{"$f":"'Calibration Matrix '!X45","v":22814.589068990445},{"$f":"'Calibration Matrix '!AA45","v":33081154.150036156},null,null,null,"1. Actual production of Breastmilk ",228.14589068990446,22814.589068990445,33081154.150036156]
[null,null,"2. Biologically feasible potential production of Breastmilk",{"$f":"'Calibration Matrix '!T45","v":430.79757713023253},{"$f":"'Calibration Matrix '!Y45","v":43079.757713023224},{"$f":"'Calibration Matrix '!AB45","v":62465648.68388366},null,null,null,"2. Biologically feasible potential production of Breastmilk",430.79757713023253,43079.757713023224,62465648.68388366]
[null,null,"3. Lost Breastmilk",{"$f":"'Calibration Matrix '!U45","v":202.65168644032806},{"$f":"'Calibration Matrix '!Z45","v":20265.168644032809},{"$f":"'Calibration Matrix '!AC45","v":29384494.533847567},null,null,null,"3. Lost Breastmilk",202.65168644032806,20265.168644032809,29384494.533847567]
[null,null,"Per Cent % lost",{"$f":"D15/D14","v":0.47041046003623488},null,null,null,null,null,"Per Cent % lost",0.47041046003623488]
[]
[null,null,{"$f":"'Country Data'!F20","v":"Exchange rate US$ 1:"},{"$f":"'Country Data'!$G$20 & \" \" & Currency","v":"1450 Iraqi Dinar                             "},null,null,null,null,null,"Exchange rate US$ 1:","1450 Iraqi Dinar                             "]
[null,null,{"$f":"'Country Data'!F14","v":"Data source:"},{"$f":"'Country Data'!Source","v":"Full data, Source: MICS"},null,null,null,null,null,"Data source:","Full data, Source: MICS"]
[]
[]
[null,{"$f":"Country2","v":"Iraq"},null,null,null,null,null,null,"Iraq"]
[]
[null,null,"TOTAL for 0 to <6 months*","Volume","Value ","Value",null,null,null,"TOTAL for 0 to <6 months*","Volume","Value ","Value"]
[null,null,{"$f":"CONCATENATE(\"(Estimate for \",'BF computation'!C9,\" Data Entries)\")","v":"(Estimate for 6 Data Entries)"}," in million Liters ","in million USD",{"$f":"CONCATENATE(\"in million \",Currency)","v":"in million Iraqi Dinar                             "},null,null,null,"(Estimate for 6 Data Entries)"," in million Liters ","in million USD","in million Iraqi Dinar                             "]
[null,null,"1. Actual production of Breastmilk ",{"$f":"'Calibration Matrix '!R56","v":101.7708197753803},{"$f":"'Calibration Matrix '!X56","v":10177.081977538031},{"$f":"'Calibration Matrix '!AA56","v":14756768.867430143},null,null,null,"1. Actual production of Breastmilk ",101.7708197753803,10177.081977538031,14756768.867430143]
[null,null,"2. Biologically feasible potential production of Breastmilk",{"$f":"'Calibration Matrix '!T56","v":120.06048372093024},{"$f":"'Calibration Matrix '!Y56","v":12006.048372093024},{"$f":"'Calibration Matrix '!AB56","v":17408770.139534887},null,null,null,"2. Biologically feasible potential production of Breastmilk",120.06048372093024,12006.048372093024,17408770.139534887]
[null,null,"3. Lost Breastmilk  ",{"$f":"'Calibration Matrix '!U56","v":18.289663945549925},{"$f":"'Calibration Matrix '!Z56","v":1828.9663945549926},{"$f":"'Calibration Matrix '!AC56","v":2652001.2721047397},null,null,null,"3. Lost Breastmilk  ",18.289663945549925,1828.9663945549926,2652001.2721047397]
[null,null,"Per Cent % lost ",{"$f":"D28/D27","v":0.15233708359915157},null,null,null,null,null,"Per Cent % lost ",0.15233708359915157]
[]
[null,null,{"$f":"'Country Data'!F20","v":"Exchange rate US$ 1:"},{"$f":"'Country Data'!$G$20 & \" \" & Currency","v":"1450 Iraqi Dinar                             "},null,null,null,null,null,"Exchange rate US$ 1:","1450 Iraqi Dinar                             "]
[null,null,{"$f":"'Country Data'!F14","v":"Data source:"},{"$f":"'Country Data'!Source","v":"Full data, Source: MICS"},null,null,null,null,null,"Data source:","Full data, Source: MICS"]
[]
[]
[null,{"$f":"Country2","v":"Iraq"},null,null,null,null,null,null,"Iraq"]
[]
[null,null,"TOTAL for 6 to <24 months*","Volume","Value ","Value",null,null,null,"TOTAL for 6 to <24 months*","Volume","Value ","Value"]
[null,null,{"$f":"CONCATENATE(\"(Estimate for \",'BF computation'!C10,\" Data Entries)\")","v":"(Estimate for 18 Data Entries)"}," in million Liters ","in million USD",{"$f":"CONCATENATE(\"in million \",Currency)","v":"in million Iraqi Dinar                             "},null,null,null,"(Estimate for 18 Data Entries)"," in million Liters ","in million USD","in million Iraqi Dinar                             "]
[null,null,"1. Actual production of Breastmilk ",{"$f":"'Calibration Matrix '!R57","v":118.45141077096773},{"$f":"'Calibration Matrix '!X57","v":11845.141077096774},{"$f":"'Calibration Matrix '!AA57","v":17175454.561790321},null,null,null,"1. Actual production of Breastmilk ",118.45141077096773,11845.141077096774,17175454.561790321]
[null,null,"2. Biologically feasible potential production of Breastmilk",{"$f":"'Calibration Matrix '!T57","v":230.24930140930235},{"$f":"'Calibration Matrix '!Y57","v":23024.930140930235},{"$f":"'Calibration Matrix '!AB57","v":33386148.70434884},null,null,null,"2. Biologically feasible potential production of Breastmilk",230.24930140930235,23024.930140930235,33386148.70434884]
[null,null,"3. Lost Breastmilk ",{"$f":"'Calibration Matrix '!U57","v":111.79789063833456},{"$f":"'Calibration Matrix '!Z57","v":11179.789063833456},{"$f":"'Calibration Matrix '!AC57","v":16210694.142558513},null,null,null,"3. Lost Breastmilk ",111.79789063833456,11179.789063833456,16210694.142558513]
[null,null,"Per Cent % lost ",{"$f":"D41/D40","v":0.48555148681905097},null,null,null,null,null,"Per Cent % lost ",0.48555148681905097]
[]
[null,null,{"$f":"'Country Data'!F20","v":"Exchange rate US$ 1:"},{"$f":"'Country Data'!$G$20 & \" \" & Currency","v":"1450 Iraqi Dinar                             "},null,null,null,null,null,"Exchange rate US$ 1:","1450 Iraqi Dinar                             "]
[null,null,{"$f":"'Country Data'!F14","v":"Data source:"},{"$f":"'Country Data'!Source","v":"Full data, Source: MICS"},null,null,null,null,null,"Data source:","Full data, Source: MICS"]
[]
[]
[null,{"$f":"Country2","v":"Iraq"},null,null,null,null,null,null,"Iraq"]
[]
[null,null,"TOTAL for 1st year*","Volume","Value ","Value",null,null,null,"TOTAL for 1st year*","Volume","Value ","Value"]
[null,null,{"$f":"CONCATENATE(\"(Estimate for \",'BF computation'!C6,\" Data Entries)\")","v":"(Estimate for 12 Data Entries)"}," in million Liters ","in million USD",{"$f":"CONCATENATE(\"in million \",Currency)","v":"in million Iraqi Dinar                             "},null,null,null,"(Estimate for 12 Data Entries)"," in million Liters ","in million USD","in million Iraqi Dinar                             "]
[null,null,"1. Actual production of Breastmilk ",{"$f":"'Calibration Matrix '!R51","v":164.14608793857937},{"$f":"'Calibration Matrix '!X51","v":16414.608793857937},{"$f":"'Calibration Matrix '!AA51","v":23801182.751094013},null,null,null,"1. Actual production of Breastmilk ",164.14608793857937,16414.608793857937,23801182.751094013]
[null,null,"2. Biologically feasible potential production of Breastmilk",{"$f":"'Calibration Matrix '!T51","v":214.21224593023257},{"$f":"'Calibration Matrix '!Y51","v":21421.224593023257},{"$f":"'Calibration Matrix '!AB51","v":31060775.659883726},null,null,null,"2. Biologically feasible potential production of Breastmilk",214.21224593023257,21421.224593023257,31060775.659883726]
[null,null,"3. Lost Breastmilk ",{"$f":"'Calibration Matrix '!U51","v":50.066157991653171},{"$f":"'Calibration Matrix '!Z51","v":5006.6157991653172},{"$f":"'Calibration Matrix '!AC51","v":7259592.9087897101},null,null,null,"3. Lost Breastmilk ",50.066157991653171,5006.6157991653172,7259592.9087897101]
[null,null,"Per Cent % lost",{"$f":"D54/D53","v":0.23372220282849454},null,null,null,null,null,"Per Cent % lost",0.23372220282849454]
[]
[null,null,{"$f":"'Country Data'!F20","v":"Exchange rate US$ 1:"},{"$f":"'Country Data'!$G$20 & \" \" & Currency","v":"1450 Iraqi Dinar                             "},null,null,null,null,null,"Exchange rate US$ 1:","1450 Iraqi Dinar                             "]
[null,null,{"$f":"'Country Data'!F14","v":"Data source:"},{"$f":"'Country Data'!Source","v":"Full data, Source: MICS"},null,null,null,null,null,"Data source:","Full data, Source: MICS"]
[]
[]
[null,{"$f":"Country2","v":"Iraq"},null,null,null,null,null,null,"Iraq"]
[]
[null,null,"TOTAL for 2nd year*","Volume","Value ","Value",null,null,null,"TOTAL for 2nd year*","Volume","Value ","Value"]
[null,null,{"$f":"CONCATENATE(\"(Estimate for \",'BF computation'!C7,\" Data Entries)\")","v":"(Estimate for 12 Data Entries)"}," in million Liters ","in million USD",{"$f":"CONCATENATE(\"in million \",Currency)","v":"in million Iraqi Dinar                             "},null,null,null,"(Estimate for 12 Data Entries)"," in million Liters ","in million USD","in million Iraqi Dinar                             "]
[null,null,"1. Actual production of Breastmilk ",{"$f":"'Calibration Matrix '!R52","v":56.076142607768659},{"$f":"'Calibration Matrix '!X52","v":5607.6142607768661},{"$f":"'Calibration Matrix '!AA52","v":8131040.6781264553},null,null,null,"1. Actual production of Breastmilk ",56.076142607768659,5607.6142607768661,8131040.6781264553]
[null,null,"2. Biologically feasible potential production of Breastmilk",{"$f":"'Calibration Matrix '!T52","v":136.0975392},{"$f":"'Calibration Matrix '!Y52","v":13609.753920000001},{"$f":"'Calibration Matrix '!AB52","v":19734143.183999997},null,null,null,"2. Biologically feasible potential production of Breastmilk",136.0975392,13609.753920000001,19734143.183999997]
[null,null,"3. Lost Breastmilk ",{"$f":"'Calibration Matrix '!U52","v":80.021396592231326},{"$f":"'Calibration Matrix '!Z52","v":8002.1396592231304},{"$f":"'Calibration Matrix '!AC52","v":11603102.505873542},null,null,null,"3. Lost Breastmilk ",80.021396592231326,8002.1396592231304,11603102.505873542]
[null,null,"Per Cent % lost ",{"$f":"D67/D66","v":0.58797092925124195},null,null,null,null,null,"Per Cent % lost ",0.58797092925124195]
[]
[null,null,{"$f":"'Country Data'!F20","v":"Exchange rate US$ 1:"},{"$f":"'Country Data'!$G$20 & \" \" & Currency","v":"1450 Iraqi Dinar                             "},null,null,null,null,null,"Exchange rate US$ 1:","1450 Iraqi Dinar                             "]
[null,null,{"$f":"'Country Data'!F14","v":"Data source:"},{"$f":"'Country Data'!Source","v":"Full data, Source: MICS"},null,null,null,null,null,"Data source:","Full data, Source: MICS"]
[]
[]
[null,{"$f":"Country2","v":"Iraq"},null,null,null,null,null,null,"Iraq"]
[]
[null,null,"TOTAL for 3rd year*","Volume","Value ","Value",null,null,null,"TOTAL for 3rd year*","Volume","Value ","Value"]
[null,null,{"$f":"CONCATENATE(\"(Estimate for \",'BF computation'!C8,\" Data Entries)\")","v":"(Estimate for 11 Data Entries)"}," in million Liters ","in million USD",{"$f":"CONCATENATE(\"in million \",Currency)","v":"in million Iraqi Dinar                             "},null,null,null,"(Estimate for 11 Data Entries)"," in million Liters ","in million USD","in million Iraqi Dinar                             "]
[null,null,"1. Actual production of Breastmilk ",{"$f":"'Calibration Matrix '!R53","v":7.9236601435564218},{"$f":"'Calibration Matrix '!X53","v":792.36601435564216},{"$f":"'Calibration Matrix '!AA53","v":1148930.7208156812},null,null,null,"1. Actual production of Breastmilk ",7.9236601435564218,792.36601435564216,1148930.7208156812]
[null,null,"2. Biologically feasible potential production of Breastmilk",{"$f":"'Calibration Matrix '!T53","v":80.48779199999997},{"$f":"'Calibration Matrix '!Y53","v":8048.7791999999981},{"$f":"'Calibration Matrix '!AB53","v":11670729.839999996},null,null,null,"2. Biologically feasible potential production of Breastmilk",80.48779199999997,8048.7791999999981,11670729.839999996]
[null,null,"3. Lost Breastmilk  ",{"$f":"'Calibration Matrix '!U53","v":72.564131856443566},{"$f":"'Calibration Matrix '!Z53","v":7256.4131856443555},{"$f":"'Calibration Matrix '!AC53","v":10521799.119184317},null,null,null,"3. Lost Breastmilk  ",72.564131856443566,7256.4131856443555,10521799.119184317]
[null,null,"Per Cent % lost ",{"$f":"D80/D79","v":0.90155450973786921},null,null,null,null,null,"Per Cent % lost ",0.90155450973786921]
[]
[null,null,{"$f":"'Country Data'!F20","v":"Exchange rate US$ 1:"},{"$f":"'Country Data'!$G$20 & \" \" & Currency","v":"1450 Iraqi Dinar                             "},null,null,null,null,null,"Exchange rate US$ 1:","1450 Iraqi Dinar                             "]
[null,null,{"$f":"'Country Data'!F14","v":"Data source:"},{"$f":"'Country Data'!Source","v":"Full data, Source: MICS"},null,null,null,null,null,"Data source:","Full data, Source: MICS"]

{"sheet":"References & Literature","index":17,"n_rows":2,"n_cols":2,"rows_kept":2,"cut":false,"hidden":true,"merged":[]}
[null,"Lost Milk Tool"]
[null,"References and Literature"]

{"sheet":"Definition of Terms","index":18,"n_rows":2,"n_cols":2,"rows_kept":2,"cut":false,"hidden":true,"merged":[]}
[null,"Lost Milk Tool"]
[null,"Definition of terms"]

{"sheet":"BF computation","index":19,"n_rows":41,"n_cols":38,"rows_kept":41,"cut":false,"hidden":true,"merged":[]}
[null,0,1,2,3,4,5,6,7,8,9,10,11,12,13,14,15,16,17,18,19,20,21,22,23,24,25,26,27,28,29,30,31,32,33,34,35,36]
[{"$f":"'Country Data'!F7","v":"Iraq"},{"$f":"IF(IFERROR(VLOOKUP($A$2, 'Database 2'!$M$3:$AY$233,COLUMN(),0),\"\")=\"\",\"\",IFERROR(VLOOKUP($A$2, 'Database 2'!$M$3:$AY$233,COLUMN(),0),\"\"))","v":0.96296296296296291},{"$f":"IF(IFERROR(VLOOKUP($A$2, 'Database 2'!$M$3:$AY$233,COLUMN(),0),\"\")=\"\",\"\",IFERROR(VLOOKUP($A$2, 'Database 2'!$M$3:$AY$233,COLUMN(),0),\"\"))","v":0.90476190476190477},{"$f":"IF(IFERROR(VLOOKUP($A$2, 'Database 2'!$M$3:$AY$233,COLUMN(),0),\"\")=\"\",\"\",IFERROR(VLOOKUP($A$2, 'Database 2'!$M$3:$AY$233,COLUMN(),0),\"\"))","v":0.88235294117647056},{"$f":"IF(IFERROR(VLOOKUP($A$2, 'Database 2'!$M$3:$AY$233,COLUMN(),0),\"\")=\"\",\"\",IFERROR(VLOOKUP($A$2, 'Database 2'!$M$3:$AY$233,COLUMN(),0),\"\"))","v":0.82954545454545459},{"$f":"IF(IFERROR(VLOOKUP($A$2, 'Database 2'!$M$3:$AY$233,COLUMN(),0),\"\")=\"\",\"\",IFERROR(VLOOKUP($A$2, 'Database 2'!$M$3:$AY$233,COLUMN(),0),\"\"))","v":0.70397111913357402},{"$f":"IF(IFERROR(VLOOKUP($A$2, 'Database 2'!$M$3:$AY$233,COLUMN(),0),\"\")=\"\",\"\",IFERROR(VLOOKUP($A$2, 'Database 2'!$M$3:$AY$233,COLUMN(),0),\"\"))","v":0.70110701107011075},{"$f":"IF(IFERROR(VLOOKUP($A$2, 'Database 2'!$M$3:$AY$233,COLUMN(),0),\"\")=\"\",\"\",IFERROR(VLOOKUP($A$2, 'Database 2'!$M$3:$AY$233,COLUMN(),0),\"\"))","v":0.70188679245283014},{"$f":"IF(IFERROR(VLOOKUP($A$2, 'Database 2'!$M$3:$AY$233,COLUMN(),0),\"\")=\"\",\"\",IFERROR(VLOOKUP($A$2, 'Database 2'!$M$3:$AY$233,COLUMN(),0),\"\"))","v":0.65600000000000003},{"$f":"IF(IFERROR(VLOOKUP($A$2, 'Database 2'!$M$3:$AY$233,COLUMN(),0),\"\")=\"\",\"\",IFERROR(VLOOKUP($A$2, 'Database 2'!$M$3:$AY$233,COLUMN(),0),\"\"))","v":0.65182186234817818},{"$f":"IF(IFERROR(VLOOKUP($A$2, 'Database 2'!$M$3:$AY$233,COLUMN(),0),\"\")=\"\",\"\",IFERROR(VLOOKUP($A$2, 'Database 2'!$M$3:$AY$233,COLUMN(),0),\"\"))","v":0.58608058608058611},{"$f":"IF(IFERROR(VLOOKUP($A$2, 'Database 2'!$M$3:$AY$233,COLUMN(),0),\"\")=\"\",\"\",IFERROR(VLOOKUP($A$2, 'Database 2'!$M$3:$AY$233,COLUMN(),0),\"\"))","v":0.63184079601990051},{"$f":"IF(IFERROR(VLOOKUP($A$2, 'Database 2'!$M$3:$AY$233,COLUMN(),0),\"\")=\"\",\"\",IFERROR(VLOOKUP($A$2, 'Database 2'!$M$3:$AY$233,COLUMN(),0),\"\"))","v":0.68663594470046085},{"$f":"IF(IFERROR(VLOOKUP($A$2, 'Database 2'!$M$3:$AY$233,COLUMN(),0),\"\")=\"\",\"\",IFERROR(VLOOKUP($A$2, 'Database 2'!$M$3:$AY$233,COLUMN(),0),\"\"))","v":0.592741935483871},{"$f":"IF(IFERROR(VLOOKUP($A$2, 'Database 2'!$M$3:$AY$233,COLUMN(),0),\"\")=\"\",\"\",IFERROR(VLOOKUP($A$2, 'Database 2'!$M$3:$AY$233,COLUMN(),0),\"\"))","v":0.50813008130081305},{"$f":"IF(IFERROR(VLOOKUP($A$2, 'Database 2'!$M$3:$AY$233,COLUMN(),0),\"\")=\"\",\"\",IFERROR(VLOOKUP($A$2, 'Database 2'!$M$3:$AY$233,COLUMN(),0),\"\"))","v":0.48375451263537905},{"$f":"IF(IFERROR(VLOOKUP($A$2, 'Database 2'!$M$3:$AY$233,COLUMN(),0),\"\")=\"\",\"\",IFERROR(VLOOKUP($A$2, 'Database 2'!$M$3:$AY$233,COLUMN(),0),\"\"))","v":0.47058823529411764},{"$f":"IF(IFERROR(VLOOKUP($A$2, 'Database 2'!$M$3:$AY$233,COLUMN(),0),\"\")=\"\",\"\",IFERROR(VLOOKUP($A$2, 'Database 2'!$M$3:$AY$233,COLUMN(),0),\"\"))","v":0.4765625},{"$f":"IF(IFERROR(VLOOKUP($A$2, 'Database 2'!$M$3:$AY$233,COLUMN(),0),\"\")=\"\",\"\",IFERROR(VLOOKUP($A$2, 'Database 2'!$M$3:$AY$233,COLUMN(),0),\"\"))","v":0.42537313432835822},{"$f":"IF(IFERROR(VLOOKUP($A$2, 'Database 2'!$M$3:$AY$233,COLUMN(),0),\"\")=\"\",\"\",IFERROR(VLOOKUP($A$2, 'Database 2'!$M$3:$AY$233,COLUMN(),0),\"\"))","v":0.32954545454545453},{"$f":"IF(IFERROR(VLOOKUP($A$2, 'Database 2'!$M$3:$AY$233,COLUMN(),0),\"\")=\"\",\"\",IFERROR(VLOOKUP($A$2, 'Database 2'!$M$3:$AY$233,COLUMN(),0),\"\"))","v":0.35897435897435898},{"$f":"IF(IFERROR(VLOOKUP($A$2, 'Database 2'!$M$3:$AY$233,COLUMN(),0),\"\")=\"\",\"\",IFERROR(VLOOKUP($A$2, 'Database 2'!$M$3:$AY$233,COLUMN(),0),\"\"))","v":0.34024896265560167},{"$f":"IF(IFERROR(VLOOKUP($A$2, 'Database 2'!$M$3:$AY$233,COLUMN(),0),\"\")=\"\",\"\",IFERROR(VLOOKUP($A$2, 'Database 2'!$M$3:$AY$233,COLUMN(),0),\"\"))","v":0.32773109243697479},{"$f":"IF(IFERROR(VLOOKUP($A$2, 'Database 2'!$M$3:$AY$233,COLUMN(),0),\"\")=\"\",\"\",IFERROR(VLOOKUP($A$2, 'Database 2'!$M$3:$AY$233,COLUMN(),0),\"\"))","v":0.28828828828828829},{"$f":"IF(IFERROR(VLOOKUP($A$2, 'Database 2'!$M$3:$AY$233,COLUMN(),0),\"\")=\"\",\"\",IFERROR(VLOOKUP($A$2, 'Database 2'!$M$3:$AY$233,COLUMN(),0),\"\"))","v":0.24352331606217617},{"$f":"IF(IFERROR(VLOOKUP($A$2, 'Database 2'!$M$3:$AY$233,COLUMN(),0),\"\")=\"\",\"\",IFERROR(VLOOKUP($A$2, 'Database 2'!$M$3:$AY$233,COLUMN(),0),\"\"))","v":0.13247863247863248},{"$f":"IF(IFERROR(VLOOKUP($A$2, 'Database 2'!$M$3:$AY$233,COLUMN(),0),\"\")=\"\",\"\",IFERROR(VLOOKUP($A$2, 'Database 2'!$M$3:$AY$233,COLUMN(),0),\"\"))","v":0.10820895522388059},{"$f":"IF(IFERROR(VLOOKUP($A$2, 'Database 2'!$M$3:$AY$233,COLUMN(),0),\"\")=\"\",\"\",IFERROR(VLOOKUP($A$2, 'Database 2'!$M$3:$AY$233,COLUMN(),0),\"\"))","v":0.12878787878787878},{"$f":"IF(IFERROR(VLOOKUP($A$2, 'Database 2'!$M$3:$AY$233,COLUMN(),0),\"\")=\"\",\"\",IFERROR(VLOOKUP($A$2, 'Database 2'!$M$3:$AY$233,COLUMN(),0),\"\"))","v":0.10756972111553785},{"$f":"IF(IFERROR(VLOOKUP($A$2, 'Database 2'!$M$3:$AY$233,COLUMN(),0),\"\")=\"\",\"\",IFERROR(VLOOKUP($A$2, 'Database 2'!$M$3:$AY$233,COLUMN(),0),\"\"))","v":9.012875536480687E-2},{"$f":"IF(IFERROR(VLOOKUP($A$2, 'Database 2'!$M$3:$AY$233,COLUMN(),0),\"\")=\"\",\"\",IFERROR(VLOOKUP($A$2, 'Database 2'!$M$3:$AY$233,COLUMN(),0),\"\"))","v":7.8703703703703706E-2},{"$f":"IF(IFERROR(VLOOKUP($A$2, 'Database 2'!$M$3:$AY$233,COLUMN(),0),\"\")=\"\",\"\",IFERROR(VLOOKUP($A$2, 'Database 2'!$M$3:$AY$233,COLUMN(),0),\"\"))","v":9.7560975609756101E-2},{"$f":"IF(IFERROR(VLOOKUP($A$2, 'Database 2'!$M$3:$AY$233,COLUMN(),0),\"\")=\"\",\"\",IFERROR(VLOOKUP($A$2, 'Database 2'!$M$3:$AY$233,COLUMN(),0),\"\"))","v":9.6385542168674704E-2},{"$f":"IF(IFERROR(VLOOKUP($A$2, 'Database 2'!$M$3:$AY$233,COLUMN(),0),\"\")=\"\",\"\",IFERROR(VLOOKUP($A$2, 'Database 2'!$M$3:$AY$233,COLUMN(),0),\"\"))","v":6.569343065693431E-2},{"$f":"IF(IFERROR(VLOOKUP($A$2, 'Database 2'!$M$3:$AY$233,COLUMN(),0),\"\")=\"\",\"\",IFERROR(VLOOKUP($A$2, 'Database 2'!$M$3:$AY$233,COLUMN(),0),\"\"))","v":7.9831932773109238E-2},{"$f":"IF(IFERROR(VLOOKUP($A$2, 'Database 2'!$M$3:$AY$233,COLUMN(),0),\"\")=\"\",\"\",IFERROR(VLOOKUP($A$2, 'Database 2'!$M$3:$AY$233,COLUMN(),0),\"\"))","v":7.5892857142857137E-2},{"$f":"IF(IFERROR(VLOOKUP($A$2, 'Database 2'!$M$3:$AY$233,COLUMN(),0),\"\")=\"\",\"\",IFERROR(VLOOKUP($A$2, 'Database 2'!$M$3:$AY$233,COLUMN(),0),\"\"))","v":""},{"$f":"IF(IFERROR(VLOOKUP($A$2, 'Database 2'!$M$3:$AY$233,COLUMN(),0),\"\")=\"\",\"\",IFERROR(VLOOKUP($A$2, 'Database 2'!$M$3:$AY$233,COLUMN(),0),\"\"))","v":6.8027210884353748E-2}]
["Iraq",0.96296296296296291,0.90476190476190477,0.88235294117647056,0.82954545454545459,0.70397111913357402,0.70110701107011075,0.70188679245283014,0.65600000000000003,0.65182186234817818,0.58608058608058611,0.63184079601990051,0.68663594470046085,0.592741935483871,0.50813008130081305,0.48375451263537905,0.47058823529411764,0.4765625,0.42537313432835822,0.32954545454545453,0.35897435897435898,0.34024896265560167,0.32773109243697479,0.28828828828828829,0.24352331606217617,0.13247863247863248,0.10820895522388059,0.12878787878787878,0.10756972111553785,9.012875536480687E-2,7.8703703703703706E-2,9.7560975609756101E-2,9.6385542168674704E-2,6.569343065693431E-2,7.9831932773109238E-2,7.5892857142857137E-2,"",6.8027210884353748E-2]
["Months",{"$f":"A2","v":"Iraq"}]
[0,0.96296296296296291,{"$f":"COUNT(B5:B40)","v":35},null,null,null,null,null,null,null,null,null,null,"P to AY"]
[1,0.90476190476190477,{"$f":"COUNT(B5:B16)","v":12},"1st","=IF(IFERROR(VLOOKUP($A$2, 'Database 2'!$M$2:$AY$233,COLUMN(),0),\"\")=\"\",\"\",IFERROR(VLOOKUP($A$2, 'Database 2'!$M$2:$AY$233,COLUMN(),0),\"\"))",null,null,null,null,null,null,null,null,"2 to 233"]
[2,0.88235294117647056,{"$f":"COUNT(B17:B28)","v":12},"2nd"]
[3,0.82954545454545459,{"$f":"COUNT(B29:B40)","v":11},"3nd"]
[4,0.70397111913357402,{"$f":"D9","v":6},{"$f":"COUNT(B5:B10)","v":6},"0-5"]
[5,0.70110701107011075,{"$f":"D10+C7","v":18},{"$f":"COUNT(B11:B16)","v":6},"6-23"]
[6,0.70188679245283014,null,null,null,null,null,null,null,null,null,null,null,"=IFERROR(VLOOKUP(Country2, 'Database 2'! $B$1:$W$37,ROW(),0),\"\")"]
[7,0.65600000000000003]
[8,0.65182186234817818]
[9,0.58608058608058611]
[10,0.63184079601990051]
[11,0.68663594470046085]
[12,0.592741935483871]
[13,0.50813008130081305]
[14,0.48375451263537905]
[15,0.47058823529411764]
[16,0.4765625]
[17,0.42537313432835822]
[18,0.32954545454545453]
[19,0.35897435897435898]
[20,0.34024896265560167]
[21,0.32773109243697479]
[22,0.28828828828828829]
[23,0.24352331606217617]
[24,0.13247863247863248]
[25,0.10820895522388059]
[26,0.12878787878787878]
[27,0.10756972111553785]
[28,9.012875536480687E-2]
[29,7.8703703703703706E-2]
[30,9.7560975609756101E-2]
[31,9.6385542168674704E-2]
[32,6.569343065693431E-2]
[33,7.9831932773109238E-2]
[34,7.5892857142857137E-2]
[35,""]
[null,6.8027210884353748E-2]

{"sheet":"BF Entry Compute","index":20,"n_rows":40,"n_cols":38,"rows_kept":40,"cut":false,"hidden":true,"merged":[]}
[null,0,1,2,3,4,5,6,7,8,9,10,11,12,13,14,15,16,17,18,19,20,21,22,23,24,25,26,27,28,29,30,31,32,33,34,35,36]
[{"$f":"'Country Data'!F7","v":"Iraq"},{"$f":"IFERROR(VLOOKUP($A$2, 'Database 2'!$H$3:$AS$233,COLUMN(),0),\"\")","v":""},{"$f":"IFERROR(VLOOKUP($A$2, 'Database 2'!$H$3:$AS$233,COLUMN(),0),\"\")","v":""},{"$f":"IFERROR(VLOOKUP($A$2, 'Database 2'!$H$3:$AS$233,COLUMN(),0),\"\")","v":""},null,null,null,null,null,6,null,18,null,30,null,null,{"$f":"IFERROR(VLOOKUP($A$2, 'Database 2'!$H$3:$AS$233,COLUMN(),0),\"\")","v":""},{"$f":"IFERROR(VLOOKUP($A$2, 'Database 2'!$H$3:$AS$233,COLUMN(),0),\"\")","v":""},{"$f":"IFERROR(VLOOKUP($A$2, 'Database 2'!$H$3:$AS$233,COLUMN(),0),\"\")","v":""},{"$f":"IFERROR(VLOOKUP($A$2, 'Database 2'!$H$3:$AS$233,COLUMN(),0),\"\")","v":""},{"$f":"IFERROR(VLOOKUP($A$2, 'Database 2'!$H$3:$AS$233,COLUMN(),0),\"\")","v":""},{"$f":"IFERROR(VLOOKUP($A$2, 'Database 2'!$H$3:$AS$233,COLUMN(),0),\"\")","v":""},{"$f":"IFERROR(VLOOKUP($A$2, 'Database 2'!$H$3:$AS$233,COLUMN(),0),\"\")","v":""},{"$f":"IFERROR(VLOOKUP($A$2, 'Database 2'!$H$3:$AS$233,COLUMN(),0),\"\")","v":""},{"$f":"IFERROR(VLOOKUP($A$2, 'Database 2'!$H$3:$AS$233,COLUMN(),0),\"\")","v":""},{"$f":"IFERROR(VLOOKUP($A$2, 'Database 2'!$H$3:$AS$233,COLUMN(),0),\"\")","v":""},{"$f":"IFERROR(VLOOKUP($A$2, 'Database 2'!$H$3:$AS$233,COLUMN(),0),\"\")","v":""},{"$f":"IFERROR(VLOOKUP($A$2, 'Database 2'!$H$3:$AS$233,COLUMN(),0),\"\")","v":""},{"$f":"IFERROR(VLOOKUP($A$2, 'Database 2'!$H$3:$AS$233,COLUMN(),0),\"\")","v":""},{"$f":"IFERROR(VLOOKUP($A$2, 'Database 2'!$H$3:$AS$233,COLUMN(),0),\"\")","v":""},{"$f":"IFERROR(VLOOKUP($A$2, 'Database 2'!$H$3:$AS$233,COLUMN(),0),\"\")","v":""},{"$f":"IFERROR(VLOOKUP($A$2, 'Database 2'!$H$3:$AS$233,COLUMN(),0),\"\")","v":""},{"$f":"IFERROR(VLOOKUP($A$2, 'Database 2'!$H$3:$AS$233,COLUMN(),0),\"\")","v":""},{"$f":"IFERROR(VLOOKUP($A$2, 'Database 2'!$H$3:$AS$233,COLUMN(),0),\"\")","v":""},{"$f":"IFERROR(VLOOKUP($A$2, 'Database 2'!$H$3:$AS$233,COLUMN(),0),\"\")","v":""},{"$f":"IFERROR(VLOOKUP($A$2, 'Database 2'!$H$3:$AS$233,COLUMN(),0),\"\")","v":""},{"$f":"IFERROR(VLOOKUP($A$2, 'Database 2'!$H$3:$AS$233,COLUMN(),0),\"\")","v":""},{"$f":"IFERROR(VLOOKUP($A$2, 'Database 2'!$H$3:$AS$233,COLUMN(),0),\"\")","v":""}]
["Bangladesh",0.9825174825174825,0.99328859060402686,0.98863636363636365,0.98516320474777452,0.99164345403899723,0.97784810126582278,0.97839506172839508,0.97428571428571431,0.9785276073619632,0.96763754045307449,0.97124600638977632,0.94771241830065356,0.9642857142857143,0.95533498759305213,0.95430107526881724,0.97319034852546915,0.95430107526881724,0.95692307692307688,0.93167701863354035,0.9140127388535032,0.91821561338289959,0.90217391304347827,0.8817567567567568,0.83453237410071945,0.7686170212765957,0.73066666666666669,0.68378378378378379,0.66,0.65838509316770188,0.65465465465465467,0.50437317784256563,0.56534954407294835,0.57692307692307687,0.53271028037383172,0.48024316109422494,0.42492917847025496,0.31284916201117319]
["Months",{"$f":"A2","v":"Iraq"},null,null,null,null,"Months","Final ","Semi-Final",null,"Linest Computation"]
[0,0.36599999999999999,null,0,0.36599999999999999,"Row No",0,0.36599999999999999,{"$f":"$K$5*(G5^3)+$L$5*(G5^2)+($M$5*G5)+$N$5","v":0.33057449302728004},null,{"$f":"LINEST(E5:E19,D5:D19^{1,2,3})","v":7.9457454680593908E-6},-1.1686881824951327E-3,2.1611400536576189E-2,0.33057449302728004]
[1,0.36599999999999999,null,1,0.36599999999999999,"Last Entry =",1,0.36599999999999999,{"$f":"$K$5*(G6^3)+$L$5*(G6^2)+($M$5*G6)+$N$5","v":0.35102515112682914}]
[2,0.36599999999999999,null,2,0.36599999999999999,{"$f":"LOOKUP(2,1/(D:D<>\"\"),ROW(D:D))","v":19},2,0.36599999999999999,0.36918610733419638]
[3,0.36599999999999999,null,3,0.36599999999999999,"No w Values",3,0.36599999999999999,0.38510503612218999]
[4,0.36599999999999999,null,4,0.36599999999999999,{"$f":"F7-5 +1","v":15},4,0.36599999999999999,0.39882961196361844]
[5,0.36599999999999999,null,5,0.36599999999999999,null,5,0.36599999999999999,0.41040750933129011]
[6,null,null,12,0.45399999999999996,null,6,0.41988640269801325,0.41988640269801325]
[7,null,null,13,0.45399999999999996,null,7,0.42731396653659626,0.42731396653659626]
[8,null,null,14,0.45399999999999996,null,8,0.43273787531984748,0.43273787531984748]
[9,null,null,15,0.45399999999999996,null,9,0.43620580352057525,0.43620580352057525]
[10,null,null,20,0.318,null,10,0.43776542561158804,0.43776542561158804]
[11,null,null,21,0.318,null,11,0.43746441606569408,0.43746441606569408]
[12,0.45399999999999996,null,22,0.318,null,12,0.45399999999999996,0.43535044935570183]
[13,0.45399999999999996,null,23,0.318,null,13,0.45399999999999996,0.43147119995441952]
[14,0.45399999999999996,null,35,1E-3,null,14,0.45399999999999996,0.42587434233465565]
[15,0.45399999999999996,null,null,null,null,15,0.45399999999999996,0.41860755096921842]
[16,null,null,null,null,null,16,0.40971850033091634,0.40971850033091634,"        \"=LINEST(\"E5:E\" & Lastrow & \",D5:D\" & Lastrow & \"^{1,2,3}\")\""]
[17,null,null,null,null,null,17,0.39925486489255768,0.39925486489255768]
[18,null,null,null,null,null,18,0.38726431912695081,0.38726431912695081]
[19,null,null,null,null,null,19,0.37379453750690411,0.37379453750690411]
[20,0.318,null,null,null,null,20,0.318,0.35889319450522589]
[21,0.318,null,null,null,null,21,0.318,0.34260796459472448]
[22,0.318,null,null,null,null,22,0.318,0.32498652224820834]
[23,0.318,null,null,null,null,23,0.318,0.30607654193848577]
[24,null,null,null,null,null,24,0.2859256981383651,0.2859256981383651]
[25,null,null,null,null,null,25,0.26458166532065486,0.26458166532065486]
[26,null,null,null,null,null,26,0.2420921179581631,0.2420921179581631]
[27,null,null,null,null,null,27,0.21850473052369834,0.21850473052369834]
[28,null,null,null,null,null,28,0.1938671774900691,0.1938671774900691]
[29,null,null,null,null,null,29,0.16822713333008343,0.16822713333008343]
[30,null,null,null,null,null,30,0.14163227251654975,0.14163227251654975]
[31,null,null,null,null,null,31,0.11413026952227667,0.11413026952227667]
[32,null,null,null,null,null,32,8.5768798820072378E-2,8.5768798820072378E-2]
[33,null,null,null,null,null,33,5.6595534882745047E-2,5.6595534882745047E-2]
[34,null,null,null,null,null,34,2.6658152183103523E-2,2.6658152183103523E-2]
[35,1E-3,null,null,null,null,35,1E-3,-3.995674806044569E-3]

{"sheet":"Calibration Matrix ","index":21,"n_rows":59,"n_cols":36,"rows_kept":59,"cut":false,"hidden":true,"merged":[[3,1,3,14],[3,15,3,28],[3,32,3,35],[0,1,0,35]]}
[]
[null,"Country Name:",null,{"$f":"'Country Data'!F7","v":"Iraq"},null,"National Currency:",null,{"$f":"_xlfn.CONCAT(Currency)","v":"Iraqi Dinar                             "},null,"Year:",{"$f":"'Country Data'!G17","v":2020}]
[null,null,null,null,null,null,"Rate to US$",{"$f":"CRate","v":1450},null,"Liverbirths:",{"$f":"'Country Data'!LiveBirth","v":1037000}]
[null,"INPUT VALUES ",null,null,null,null,null,null,null,null,null,null,null,null,null,"CALCULATED VALUES (Year, census)",null,null,null,null,null,null,null,null,null,null,null,null,null,null,null,null,"OPTIONAL"]
[null,"Age","Percent of","Percent of","Percent of","Potential","Average no. of","No. of infants","No. of infants","No. of infants","No. of infants ","Liters of","Liters of","Estimated liters","Estimated liters","Annual production of","Annual production of","Total Actual Annual production of","Average annual production ","Biologically feasible potential production of ","Lost BM [actual-biologically feasible]","Lost production value ","Price per liter of breastmilk","Value actual production of breastmilk","Value Biologically feasible breastmilk","Loss value  of breastmilk","Value actual production of breastmilk ","Value Biologically feasible breastmilk","Loss value  of breastmilk","TOTAL  0-11 MONTHS",null,null,"Cost of additional diet for actual breastfeeding mother ","Total actual annual cost","Cost of additional diet for actual  breastfeeding mother ","Total actual annual cost"]
[null,"<months>","infants","infants","infants","infants","infants living","breastfed fully/exclusively",{"$f":"_xlfn.CONCAT(\"breastfed (partially/any breastfeeding) \")","v":"breastfed (partially/any breastfeeding) "},"not breastfeeding ","breastfed","breastmilk","breastmilk","fully pr. month pr.","partially  pr. month pr.","breastmilk (fully)","breastmilk (partial)","breastmilk ","of breastmilk per child ","breastmilk","breastmilk","% of potential breastmilk production","($US)","in million $US","in million $US","in million $US (2018)",{"$f":"_xlfn.CONCAT(\"in million) \",'Country Data'!Currency,\"\")","v":"in million) Iraqi Dinar                             "},{"$f":"_xlfn.CONCAT(\"in million) \",'Country Data'!Currency,\"\")","v":"in million) Iraqi Dinar                             "},{"$f":"_xlfn.CONCAT(\"in million) \",'Country Data'!Currency,\"\")","v":"in million) Iraqi Dinar                             "},null,null,null,"in $USD ","in million $USD",{"$f":"_xlfn.CONCAT(\"in million) \",'Country Data'!Currency,\"\")","v":"in million) Iraqi Dinar                             "},{"$f":"_xlfn.CONCAT(\"in million) \",'Country Data'!Currency,\"\")","v":"in million) Iraqi Dinar                             "}]
[null,null,"breastfed (fully/exclusive)-YEAR ",{"$f":"_xlfn.CONCAT(\"breastfed (partially/any breastfeeding) \",Source,\" \", 'Country Data'!BFYear)","v":"breastfed (partially/any breastfeeding) MICS 2018"},{"$f":"_xlfn.CONCAT(\"Not  breastfeeding \",Source,\" \", 'Country Data'!BFYear)","v":"Not  breastfeeding MICS 2018"},"breastfeeding (optimal)","each month a)","each month a)","each month a)","each month a)","potentially each month","fully per  infant pr. day b)","partially  per  infant pr. day b)","infant c) [actual]","infant c) [actual]","Volume (million liters)","Volume (million liters)","Volume (million liters)","litres/child 0-35 months","Volume (million liters)","Volume (million liters)"]
[null,0,null,{"$f":"IF('BF computation'!B5=\"\",0, 'BF computation'!B5)","v":0.96296296296296291},{"$f":"1-D8","v":3.703703703703709E-2},0.98,{"$f":"live","v":1037000},{"$f":"G8*C8","v":0},{"$f":"G8*D8","v":998592.59259259258},{"$f":"I8*E8","v":36984.910836762741},{"$f":"G8*F8","v":1016260},0.67732558139534882,0.59205426356589141,{"$f":"L8*30","v":20.319767441860463},{"$f":"M8*30","v":17.761627906976742},{"$f":"N8*H8/1000000","v":0},{"$f":"O8*I8/1000000","v":17.736630060292846},{"$f":"SUM(P8:Q8)","v":17.736630060292846},{"$f":"R8/(G8*3)*1000000","v":5.7012632787826565},{"$f":"IF('BF computation'!B5=\"\", 0, K8*O8/1000000)","v":18.050431976744182},{"$f":"MAX(0,T8-R8)","v":0.31380191645133593},{"$f":"U8/T8","v":1.7384731670446008E-2},{"$f":"BMPrice","v":100},{"$f":"W8*R8","v":1773.6630060292846},{"$f":"W8*T8","v":1805.0431976744183},{"$f":"MAX(0,Y8-X8)","v":31.380191645133664},{"$f":"X8*CRate","v":2571811.3587424625},{"$f":"Y8*CRate","v":2617312.6366279065},{"$f":"MAX(0,AB8-AA8)","v":45501.277885443997},null,null,null,{"$f":"(450/2250)*4.57*30","v":27.420000000000005},{"$f":"((H8+I8)*AG8)/1000000","v":27.381408888888895},{"$f":"AH8*CRate","v":39703.0428888889},{"$f":"AI8*(H8+I8)/1000000","v":39647.164532230461}]
[null,{"$f":"B8+1","v":1},null,{"$f":"IF('BF computation'!B6=\"\",0, 'BF computation'!B6)","v":0.90476190476190477},{"$f":"1-D9","v":9.5238095238095233E-2},0.98,1037000,{"$f":"G9*C9","v":0},{"$f":"G9*D9","v":938238.09523809527},89356.009070294778,1016260,0.70833333333333326,0.67538759689922478,21.249999999999996,20.261627906976745,{"$f":"N9*H9/1000000","v":0},19.010231173864899,{"$f":"SUM(P9:Q9)","v":19.010231173864899},{"$f":"R9/(G9*3)*1000000","v":6.1106496862310831},{"$f":"IF('BF computation'!B6=\"\", 0, K9*O9/1000000)","v":20.591081976744185},{"$f":"MAX(0,T9-R9)","v":1.5808508028792865},{"$f":"U9/T9","v":7.6773566569484711E-2},100,{"$f":"W9*R9","v":1901.02311738649},{"$f":"W9*T9","v":2059.1081976744185},{"$f":"MAX(0,Y9-X9)","v":158.08508028792858},{"$f":"X9*CRate","v":2756483.5202104105},{"$f":"Y9*CRate","v":2985706.8866279069},{"$f":"MAX(0,AB9-AA9)","v":229223.36641749647},null,null,null,27.420000000000005,{"$f":"((H9+I9)*AG9)/1000000","v":25.726488571428579},{"$f":"AH9*CRate","v":37303.408428571442},{"$f":"AI9*(H9+I9)/1000000","v":34999.478869911574}]
[null,{"$f":"B9+1","v":2},null,{"$f":"IF('BF computation'!B7=\"\",0, 'BF computation'!B7)","v":0.88235294117647056},0.11764705882352944,0.98,1037000,0,915000,107647.05882352944,1016260,0.7277131782945736,0.70736434108527124,21.831395348837209,21.220930232558139,0,19.417151162790699,19.417151162790699,{"$f":"R10/(G10*3)*1000000","v":6.2414500683994527},{"$f":"IF('BF computation'!B7=\"\", 0, K10*O10/1000000)","v":21.565982558139535},2.1488313953488358,9.9639855942376884E-2,100,1941.7151162790699,2156.5982558139535,214.88313953488364,2815486.9186046515,3127067.4709302327,311580.5523255812,null,null,null,27.420000000000005,{"$f":"(H10+I10)*AG10/1000000","v":25.089300000000005},36379.485000000008,{"$f":"AI10*(H10+I10)/1000000","v":33287.228775000011}]
[null,3,null,{"$f":"IF('BF computation'!B8=\"\",0, 'BF computation'!B8)","v":0.82954545454545459},0.17045454545454541,0.98,1037000,0,860238.63636363635,146631.58574380161,1016260,0.7558139534883721,0.68217054263565891,22.674418604651162,20.465116279069768,0,17.604883720930232,17.604883720930232,5.6589147286821699,{"$f":"IF('BF computation'!B8=\"\", 0, K11*O11/1000000)","v":20.79787906976744},3.1929953488372078,0.1535250463821892,100,1760.4883720930231,2079.7879069767441,319.29953488372098,2552708.1395348837,3015692.4651162792,462984.32558139553,null,null,null,27.420000000000005,23.587743409090915,34202.227943181824,{"$f":"AI11*(H11+I11)/1000000","v":29422.07792644099}]
[null,4,null,{"$f":"IF('BF computation'!B9=\"\",0, 'BF computation'!B9)","v":0.70397111913357402},0.29602888086642598,0.98,1037000,0,730018.05054151628,216106.42651409507,1016260,0.77131782945736438,0.68798449612403101,23.13953488372093,20.63953488372093,0,15.067233019897575,15.067233019897575,4.8432121568298214,{"$f":"IF('BF computation'!B9=\"\", 0, K12*O12/1000000)","v":20.975133720930234},5.9079007010326592,0.28166212333308777,100,1506.7233019897576,2097.5133720930235,590.79007010326586,2184748.7878851485,3041394.3895348841,856645.60164973559,null,null,null,27.420000000000005,20.017094945848378,29024.787671480146,21188.618913315371]
[null,5,null,{"$f":"IF('BF computation'!B10=\"\",0, 'BF computation'!B10)","v":0.70110701107011075},0.29889298892988925,0.98,1037000,0,727047.97047970491,217309.54099208888,1016260,0.82751937984496116,0.59302325581395343,24.825581395348834,17.790697674418603,0,12.934690637604051,12.934690637604051,4.1577276237878662,{"$f":"IF('BF computation'!B10=\"\", 0, K13*O13/1000000)","v":18.07997441860465},5.1452837810005985,0.28458468258151959,100,1293.4690637604051,1807.997441860465,514.52837810005985,1875530.1424525874,2621596.2906976743,746066.14824508689,null,null,null,27.420000000000005,19.935655350553514,28906.700258302597,21016.557756064063]
[null,6,null,{"$f":"IF('BF computation'!B11=\"\",0, 'BF computation'!B11)","v":0.70188679245283014},0.29811320754716986,0.98,1037000,0,727856.60377358482,216983.66678533287,1016260,0.84011627906976738,0.5513565891472868,25.20348837209302,16.540697674418603,0,12.039256033347957,12.039256033347957,3.8698990785432201,{"$f":"IF('BF computation'!B11=\"\", 0, K14*O14/1000000)","v":16.80964941860465},4.7703933852566927,0.28378898729303048,100,1203.9256033347958,1680.9649418604649,477.03933852566911,1745692.1248354539,2437399.1656976743,691707.04086222034,null,null,null,27.420000000000005,19.957828075471699,28938.850709433966,21063.333594479402]
[null,7,null,{"$f":"IF('BF computation'!B12=\"\",0, 'BF computation'!B12)","v":0.65600000000000003},0.34399999999999997,0.98,1037000,0,680272,234013.56799999997,1016260,0.7897286821705426,0.40406976744186046,23.691860465116278,12.122093023255815,0,8.2463204651162787,8.2463204651162787,2.6506976744186046,{"$f":"IF('BF computation'!B12=\"\", 0, K15*O15/1000000)","v":12.319198255813955},4.0728777906976763,0.33061224489795932,100,824.63204651162789,1231.9198255813956,407.28777906976768,1195716.4674418604,1786283.7470930235,590567.27965116315,null,null,null,27.420000000000005,18.653058240000004,27046.934448000004,18399.272190809861]
[null,8,null,{"$f":"IF('BF computation'!B13=\"\",0, 'BF computation'!B13)","v":0.65182186234817818},0.34817813765182182,0.98,1037000,0,675939.2712550608,235347.27663131669,1016260,0.86240310077519378,0.48158914728682167,25.872093023255815,14.447674418604651,0,9.7657505178420116,9.7657505178420116,3.139103348711672,{"$f":"IF('BF computation'!B13=\"\", 0, K16*O16/1000000)","v":14.682593604651162},4.9168430868091502,0.33487565066512426,100,976.57505178420115,1468.2593604651163,491.68430868091514,1416033.8250870917,2128976.0726744188,712942.24758732715,null,null,null,27.420000000000005,18.534254817813768,26874.669485829963,18165.644507472527]
[null,9,null,{"$f":"IF('BF computation'!B14=\"\",0, 'BF computation'!B14)","v":0.58608058608058611},0.41391941391941389,0.98,1037000,0,607765.5677655678,251565.96760992365,1016260,null,0.66957364341085268,0,20.087209302325579,0,12.2083141664537,12.2083141664537,3.9242411335434584,{"$f":"IF('BF computation'!B14=\"\", 0, K17*O17/1000000)","v":20.413827325581394},8.205513159127694,0.40195858563205505,100,1220.8314166453699,2041.3827325581394,820.5513159127695,1770205.5541357864,2960004.962209302,1189799.4080735156,null,null,null,27.420000000000005,16.664931868131873,24164.151208791216,14686.139078984024]
[null,10,null,{"$f":"IF('BF computation'!B15=\"\",0, 'BF computation'!B15)","v":0.63184079601990051},0.36815920398009949,0.98,1037000,0,655218.9054726368,241224.87067151803,1016260,0.88178294573643412,0.5,26.453488372093023,15,0,9.8282835820895524,9.8282835820895524,3.1592039800995027,{"$f":"IF('BF computation'!B15=\"\", 0, K18*O18/1000000)","v":15.2439},5.4156164179104476,0.3552644938572444,100,982.82835820895525,1524.39,541.56164179104485,1425101.1194029851,2210365.5,785264.38059701491,null,null,null,27.420000000000005,17.966102388059706,26050.848462686576,17069.00841635502]
[null,11,null,{"$f":"IF('BF computation'!B16=\"\",0, 'BF computation'!B16)","v":0.68663594470046085},0.31336405529953915,0.98,1037000,0,712041.4746543779,223128.20403915987,1016260,null,0.48158914728682167,0,14.447674418604651,0,10.287343398349586,10.287343398349586,3.3067641910477619,{"$f":"IF('BF computation'!B16=\"\", 0, K19*O19/1000000)","v":14.682593604651162},4.3952502063015757,0.2993510768362645,100,1028.7343398349585,1468.2593604651163,439.52502063015777,1491664.7927606897,2128976.0726744188,637311.27991372906,null,null,null,27.420000000000005,19.524177235023043,28310.056990783411,20157.9347272669]
[null,12,null,{"$f":"IF('BF computation'!B17=\"\",0, 'BF computation'!B17)","v":0.592741935483871},0.407258064516129,0.98,1037000,0,614673.38709677418,250330.6939386056,1016260,null,0.372,0,11.16,0,6.8597549999999998,{"$f":"SUM(P20:Q20)","v":6.8597549999999998},2.2050000000000001,{"$f":"IF('BF computation'!B17=\"\", 0, K20*O20/1000000)","v":11.341461599999999},4.481706599999999,0.39516129032258057,100,685.97550000000001,1134.1461599999998,448.17065999999977,994664.47499999998,1644511.9319999998,649847.45699999982,null,null,null,27.420000000000005,16.854344274193551,24438.799197580647,15021.879479354824]
[null,13,null,{"$f":"IF('BF computation'!B18=\"\",0, 'BF computation'!B18)","v":0.50813008130081305},0.49186991869918695,0.98,1037000,0,526930.89430894319,259181.45614382977,1016260,null,0.372,0,11.16,0,5.880548780487806,{"$f":"SUM(P21:Q21)","v":5.880548780487806},1.8902439024390247,{"$f":"IF('BF computation'!B18=\"\", 0, K21*O21/1000000)","v":11.341461599999999},5.4609128195121928,0.48149991703998657,100,588.05487804878055,1134.1461599999998,546.09128195121923,852679.57317073178,1644511.9319999998,791832.35882926802,null,null,null,27.420000000000005,14.448445121951224,20950.245426829275,11039.331558750997]
[null,14,null,{"$f":"IF('BF computation'!B19=\"\",0, 'BF computation'!B19)","v":0.48375451263537905},0.51624548736462095,0.98,1037000,0,501653.42960288806,258976.31925347651,1016260,null,0.372,0,11.16,0,5.5984522743682312,5.5984522743682312,1.7995667870036103,{"$f":"IF('BF computation'!B19=\"\", 0, K22*O22/1000000)","v":11.341461599999999},5.7430093256317676,0.5063729462904295,100,559.84522743682317,1134.1461599999998,574.30093256317662,811775.57978339354,1644511.9319999998,832736.35221660626,null,null,null,27.420000000000005,13.755337039711193,19945.238707581229,10005.5974019064]
[null,15,null,{"$f":"IF('BF computation'!B20=\"\",0, 'BF computation'!B20)","v":0.47058823529411764},0.52941176470588236,0.98,1037000,0,488000,258352.9411764706,1016260,null,0.372,0,11.16,0,5.4460800000000003,5.4460800000000003,1.7505882352941178,{"$f":"IF('BF computation'!B20=\"\", 0, K23*O23/1000000)","v":11.341461599999999},5.8953815999999986,0.5198079231692676,100,544.60800000000006,1134.1461599999998,589.53815999999972,789681.60000000009,1644511.9319999998,854830.3319999997,null,null,null,27.420000000000005,13.380960000000002,19402.392000000003,9468.3672960000022]
[null,16,null,{"$f":"IF('BF computation'!B21=\"\",0, 'BF computation'!B21)","v":0.4765625},0.5234375,0.98,1037000,0,494195.3125,258680.35888671875,1016260,null,0.372,0,11.16,0,5.5152196875000001,5.5152196875000001,1.7728125000000001,{"$f":"IF('BF computation'!B21=\"\", 0, K24*O24/1000000)","v":11.341461599999999},5.8262419124999987,0.51371173469387754,100,551.52196875000004,1134.1461599999998,582.62419124999974,799706.85468750005,1644511.9319999998,844805.07731249975,null,null,null,27.420000000000005,13.550835468750002,19648.711429687501,9710.3010852167354]
[null,17,null,{"$f":"IF('BF computation'!B22=\"\",0, 'BF computation'!B22)","v":0.42537313432835822},0.57462686567164178,0.98,1037000,0,441111.94029850746,253474.77166406772,1016260,null,0.372,0,11.16,0,4.9228092537313426,4.9228092537313426,1.5823880597014923,{"$f":"IF('BF computation'!B22=\"\", 0, K25*O25/1000000)","v":11.341461599999999},6.4186523462686562,0.56594578129759365,100,492.28092537313427,1134.1461599999998,641.86523462686546,713807.34179104469,1644511.9319999998,930704.59020895511,null,null,null,27.420000000000005,12.095289402985077,17538.169634328362,7736.2960366829493]
[null,18,null,{"$f":"IF('BF computation'!B23=\"\",0, 'BF computation'!B23)","v":0.32954545454545453},0.67045454545454541,0.98,1037000,0,341738.63636363635,229120.22210743799,1016260,null,0.372,0,11.16,0,3.8138031818181815,3.8138031818181815,1.2259090909090908,{"$f":"IF('BF computation'!B23=\"\", 0, K26*O26/1000000)","v":11.341461599999999},7.5276584181818169,0.6637291280148423,100,381.38031818181815,1134.1461599999998,752.76584181818157,553001.46136363631,1644511.9319999998,1091510.4706363636,null,null,null,27.420000000000005,9.370473409090911,13587.186443181821,4643.2665671114419]
[null,19,null,{"$f":"IF('BF computation'!B24=\"\",0, 'BF computation'!B24)","v":0.35897435897435898},0.64102564102564097,0.98,1037000,0,372256.41025641025,238625.90401051936,1016260,null,0.372,0,11.16,0,4.1543815384615383,4.1543815384615383,1.3353846153846154,{"$f":"IF('BF computation'!B24=\"\", 0, K27*O27/1000000)","v":11.341461599999999},7.1870800615384605,0.63369963369963367,100,415.43815384615385,1134.1461599999998,718.70800615384587,602385.32307692303,1644511.9319999998,1042126.6089230768,null,null,null,27.420000000000005,10.207270769230771,14800.542615384618,5509.5968638500999]
[null,20,null,{"$f":"IF('BF computation'!B25=\"\",0, 'BF computation'!B25)","v":0.34024896265560167},0.65975103734439833,0.98,1037000,0,352838.17427385895,232785.35149188203,1016260,null,0.372,0,11.16,0,3.9376740248962658,3.9376740248962658,1.2657261410788383,{"$f":"IF('BF computation'!B25=\"\", 0, K28*O28/1000000)","v":11.341461599999999},7.403787575103733,0.65280718096367174,100,393.76740248962659,1134.1461599999998,740.37875751037313,570962.73360995855,1644511.9319999998,1073549.1983900412,null,null,null,27.420000000000005,9.6748227385892136,14028.492970954359,4949.7878476852002]
[null,21,null,{"$f":"IF('BF computation'!B26=\"\",0, 'BF computation'!B26)","v":0.32773109243697479},0.67226890756302526,0.98,1037000,0,339857.14285714284,228475.39015606244,1016260,null,0.372,0,11.16,0,3.7928057142857141,3.7928057142857141,1.2191596638655462,{"$f":"IF('BF computation'!B26=\"\", 0, K29*O29/1000000)","v":11.341461599999999},7.5486558857142843,0.66558051792145423,100,379.28057142857142,1134.1461599999998,754.86558857142836,549956.82857142854,1644511.9319999998,1094555.1034285713,null,null,null,27.420000000000005,9.3188828571428584,13512.380142857144,4592.2789085510203]
[null,22,null,{"$f":"IF('BF computation'!B27=\"\",0, 'BF computation'!B27)","v":0.28828828828828829},0.71171171171171177,0.98,1037000,0,298954.95495495497,212769.74271568868,1016260,null,0.372,0,11.16,0,3.3363372972972973,3.3363372972972973,1.0724324324324324,{"$f":"IF('BF computation'!B27=\"\", 0, K30*O30/1000000)","v":11.341461599999999},8.0051243027027006,0.7058282772568486,100,333.63372972972974,1134.1461599999998,800.51243027026999,483768.90810810809,1644511.9319999998,1160743.0238918918,null,null,null,27.420000000000005,8.197344864864867,11886.150054054056,3553.4234539975664]
[null,23,null,{"$f":"IF('BF computation'!B28=\"\",0, 'BF computation'!B28)","v":0.24352331606217617},0.75647668393782386,0.98,1037000,0,{"$f":"G31*D31","v":252533.6787564767},191035.83988831917,1016260,null,0.372,0,11.16,0,2.8182758549222804,2.8182758549222804,0.90590673575129554,{"$f":"IF('BF computation'!B28=\"\", 0, K31*O31/1000000)","v":11.341461599999999},8.5231857450777184,0.75150682034471816,100,281.82758549222802,1134.1461599999998,852.3185745077717,408649.99896373064,1644511.9319999998,1235861.9330362692,null,null,null,27.420000000000005,6.9244734715025924,10040.486533678759,2535.5610008547619]
[null,24,null,{"$f":"IF('BF computation'!B29=\"\",0, 'BF computation'!B29)","v":0.13247863247863248},0.86752136752136755,0.98,1037000,0,137380.34188034188,119180.38205858719,1016260,null,0.24,0,7.1999999999999993,0,0.98913846153846141,0.98913846153846141,0.31794871794871787,{"$f":"IF('BF computation'!B29=\"\", 0, K32*O32/1000000)","v":7.3170719999999987},6.3279335384615374,0.86481772196057916,100,98.913846153846137,731.70719999999983,632.79335384615365,143425.07692307691,1060975.4399999997,917550.36307692283,null,null,null,27.420000000000005,3.7669689743589752,5462.1050128205143,750.38585404761136]
[null,25,null,{"$f":"IF('BF computation'!B30=\"\",0, 'BF computation'!B30)","v":0.10820895522388059},0.89179104477611937,0.98,1037000,{"$f":"G33*C33","v":0},112212.68656716417,100070.26899086655,1016260,null,0.24,0,7.1999999999999993,0,0.80793134328358196,0.80793134328358196,0.25970149253731339,{"$f":"IF('BF computation'!B30=\"\", 0, K33*O33/1000000)","v":7.3170719999999987},6.5091406567164167,0.88958269875114226,100,80.793134328358192,731.70719999999983,650.91406567164165,117150.04477611938,1060975.4399999997,943825.3952238803,null,null,null,27.420000000000005,3.0768718656716421,4461.4642052238814,500.63288449140958]
[null,26,null,{"$f":"IF('BF computation'!B31=\"\",0, 'BF computation'!B31)","v":0.12878787878787878},0.87121212121212122,0.98,1037000,0,133553.0303030303,116353.01882460974,1016260,null,0.24,0,7.1999999999999993,0,0.96158181818181809,0.96158181818181809,0.30909090909090908,{"$f":"IF('BF computation'!B31=\"\", 0, K34*O34/1000000)","v":7.3170719999999987},6.3554901818181806,0.86858379715522571,100,96.158181818181816,731.70719999999983,635.54901818181804,139429.36363636365,1060975.4399999997,921546.07636363606,null,null,null,27.420000000000005,3.6620240909090915,5309.934931818183,709.15790085623303]
[null,27,null,{"$f":"IF('BF computation'!B32=\"\",0, 'BF computation'!B32)","v":0.10756972111553785},0.89243027888446214,0.98,1037000,0,111549.80079681275,99550.419834605796,1016260,null,0.24,0,7.1999999999999993,0,0.8031585657370518,0.8031585657370518,0.25816733067729081,{"$f":"IF('BF computation'!B32=\"\", 0, K35*O35/1000000)","v":7.3170719999999987},6.513913434262947,0.89023497845353283,100,80.315856573705176,731.70719999999983,651.39134342629461,116457.99203187251,1060975.4399999997,944517.44796812721,null,null,null,27.420000000000005,3.0586955378486063,4435.1085298804792,494.73547302041248]
[null,28,null,{"$f":"IF('BF computation'!B33=\"\",0, 'BF computation'!B33)","v":9.012875536480687E-2},0.90987124463519309,0.98,1037000,0,93463.519313304729,85039.768645581978,1016260,null,0.24,0,7.1999999999999993,0,0.67293733905579389,0.67293733905579389,0.21630901287553644,{"$f":"IF('BF computation'!B33=\"\", 0, K36*O36/1000000)","v":7.3170719999999987},6.6441346609442045,0.90803188228080922,100,67.293733905579387,731.70719999999983,664.41346609442041,97575.914163090114,1060975.4399999997,963399.52583690966,null,null,null,27.420000000000005,2.5627696995708158,3716.0160643776831,347.31193920151418]
[null,29,null,{"$f":"IF('BF computation'!B34=\"\",0, 'BF computation'!B34)","v":7.8703703703703706E-2},0.92129629629629628,0.98,1037000,0,81615.740740740745,75192.279663923182,1016260,null,0.24,0,7.1999999999999993,0,0.58763333333333323,0.58763333333333323,0.18888888888888886,{"$f":"IF('BF computation'!B34=\"\", 0, K37*O37/1000000)","v":7.3170719999999987},6.729438666666665,0.91969009826152681,100,58.763333333333321,731.70719999999983,672.94386666666651,85206.833333333314,1060975.4399999997,975768.60666666646,null,null,null,27.420000000000005,2.2379036111111117,3244.960236111112,264.83983334445736]
[null,30,null,{"$f":"IF('BF computation'!B35=\"\",0, 'BF computation'!B35)","v":9.7560975609756101E-2},0.90243902439024393,0.98,1037000,0,101170.73170731707,91300.416418798341,1016260,null,0.24,0,7.1999999999999993,0,0.72842926829268284,0.72842926829268284,0.23414634146341462,{"$f":"IF('BF computation'!B35=\"\", 0, K38*O38/1000000)","v":7.3170719999999987},6.5886427317073162,0.90044798407167748,100,72.842926829268279,731.70719999999983,658.86427317073151,105622.243902439,1060975.4399999997,955353.19609756069,null,null,null,27.420000000000005,2.7741014634146346,4022.4471219512202,406.95391858179659]
[null,31,null,{"$f":"IF('BF computation'!B36=\"\",0, 'BF computation'!B36)","v":9.6385542168674704E-2},0.90361445783132532,0.98,1037000,0,99951.80722891567,90317.898098417776,1016260,null,0.24,0,7.1999999999999993,0,0.71965301204819276,0.71965301204819276,0.23132530120481928,{"$f":"IF('BF computation'!B36=\"\", 0, K39*O39/1000000)","v":7.3170719999999987},6.5974189879518059,0.90164740595033188,100,71.965301204819269,731.70719999999983,659.74189879518053,104349.68674698794,1060975.4399999997,956625.75325301173,null,null,null,27.420000000000005,2.7406785542168683,3973.983903614459,397.20687306488622]
[null,32,null,{"$f":"IF('BF computation'!B37=\"\",0, 'BF computation'!B37)","v":6.569343065693431E-2},0.93430656934306566,0.98,1037000,0,68124.087591240881,{"$f":"I40*E40","v":63648.78256699878},1016260,null,0.24,0,7.1999999999999993,0,0.49049343065693429,0.49049343065693429,0.15766423357664233,{"$f":"IF('BF computation'!B37=\"\", 0, K40*O40/1000000)","v":7.3170719999999987},6.8265785693430647,0.93296588708476091,100,49.049343065693428,731.70719999999983,682.65785693430644,71121.547445255477,1060975.4399999997,989853.89255474426,null,null,null,27.420000000000005,1.8679624817518254,2708.5455985401468,184.51719759981893]
[null,33,null,{"$f":"IF('BF computation'!B38=\"\",0, 'BF computation'!B38)","v":7.9831932773109238E-2},0.92016806722689082,0.98,1037000,0,82785.714285714275,76176.770708283308,1016260,null,0.24,0,7.1999999999999993,0,0.59605714285714273,0.59605714285714273,0.19159663865546214,{"$f":"IF('BF computation'!B38=\"\", 0, K41*O41/1000000)","v":7.3170719999999987},6.7210148571428556,0.91853884410907216,100,59.605714285714271,731.70719999999983,672.10148571428556,86428.285714285696,1060975.4399999997,974547.15428571403,null,null,null,27.420000000000005,2.269984285714286,3291.4772142857146,272.48729223979592]
[null,34,null,{"$f":"IF('BF computation'!B39=\"\",0, 'BF computation'!B39)","v":7.5892857142857137E-2},0.9241071428571429,0.98,1037000,0,78700.892857142855,72728.057238520414,1016260,null,0.24,0,7.1999999999999993,0,0.56664642857142855,0.56664642857142855,0.18214285714285713,{"$f":"IF('BF computation'!B39=\"\", 0, K42*O42/1000000)","v":7.3170719999999987},6.7504255714285701,0.92255830903790081,100,56.664642857142852,731.70719999999983,675.04255714285694,82163.73214285713,1060975.4399999997,978811.70785714255,null,null,null,27.420000000000005,2.1579784821428571,3129.0687991071427,246.26050830115989]
[null,35,null,{"$f":"IF('BF computation'!B40=\"\",0, 'BF computation'!B40)","v":0},1,0.98,1037000,0,0,0,1016260,null,0.24,0,7.1999999999999993,0,0,0,0,{"$f":"IF('BF computation'!B40=\"\", 0, K43*O43/1000000)","v":0},0,{"$error":"#DIV/0!"},100,0,0,0,0,0,0,null,null,null,27.420000000000005,0,0,0]
[]
[null,null,null,null,null,null,null,null,null,null,null,null,null,null,null,null,null,{"$f":"SUM(R8:R43)","v":228.14589068990446},{"$f":"R45/(G9*3)*1000000","v":73.335226836999183},{"$f":"SUM(T8:T43)","v":430.79757713023253},{"$f":"MAX(0,T45-R45)","v":202.65168644032806},{"$f":"U45/T45","v":0.47041046003623488},null,{"$f":"SUM(X8:X43)","v":22814.589068990445},43079.757713023224,20265.168644032809,33081154.150036156,62465648.68388366,29384494.533847567,null,null,null,null,{"$f":"SUM(AH9:AH43)","v":393.61105336614452},{"$f":"SUM(AI9:AI43)","v":570736.02738090954},{"$f":"SUM(AJ9:AJ43)","v":342795.47193081077}]
[]
[null,null,null,null,null,null,null,null,null,null,null,null,null,null,null,null,null,null,null,null,null,null,null,"0-11","0-12","0-13","0-14","0-15","0-16"]
[null,null,null,null,null,null,null,null,null,null,null,null,null,null,null,null,null,null,null,null,null,null,null,"12-23","12-24","12-25","12-26","12-27","12-28"]
[null,null,null,null,null,null,null,null,null,null,null,null,null,null,null,null,null,null,null,null,null,null,null,"24-35","24-36","24-37","24-38","24-39","24-40"]
[]
[null,null,null,null,null,null,null,null,null,null,null,null,null,null,null,null,"0-11",{"$f":"SUM(R8:R19)","v":164.14608793857937},{"$f":"SUM(S8:S19)","v":52.763126949077268},{"$f":"SUM(T8:T19)","v":214.21224593023257},{"$f":"SUM(U8:U19)","v":50.066157991653171},{"$f":"U51/T51","v":0.23372220282849454},null,{"$f":"SUM(X8:X19)","v":16414.608793857937},21421.224593023257,5006.6157991653172,23801182.751094013,31060775.659883726,7259592.9087897101]
[null,null,null,null,null,null,null,null,null,null,null,null,null,null,null,null,"12-23",{"$f":"SUM(R20:R31)","v":56.076142607768659},{"$f":"SUM(S20:S31)","v":18.025118163860064},{"$f":"SUM(T20:T31)","v":136.0975392},{"$f":"SUM(U20:U31)","v":80.021396592231326},{"$f":"U52/T52","v":0.58797092925124195},null,{"$f":"SUM(X20:X31)","v":5607.6142607768661},13609.753920000001,8002.1396592231304,8131040.6781264553,19734143.183999997,11603102.505873542]
[null,null,null,null,null,null,null,null,null,null,null,null,null,null,null,null,"24-35",{"$f":"SUM(R32:R43)","v":7.9236601435564218},{"$f":"SUM(S32:S43)","v":2.546981724061852},{"$f":"SUM(T32:T43)","v":80.48779199999997},{"$f":"SUM(U32:U43)","v":72.564131856443566},0.90155450973786921,null,{"$f":"SUM(X32:X43)","v":792.36601435564216},8048.7791999999981,7256.4131856443555,1148930.7208156812,11670729.839999996,10521799.119184317]
[null,null,null,null,null,null,null,null,null,null,null,null,null,null,null,null,null,{"$f":"SUM(R51:R53)","v":228.14589068990446},{"$f":"SUM(S51:S53)","v":73.335226836999183},430.79757713023253,202.65168644032806,0.47041046003623488,null,{"$f":"SUM(X51:X53)","v":22814.589068990445},{"$f":"SUM(Y51:Y53)","v":43079.757713023253},20265.168644032805,33081154.150036149,62465648.683883719,{"$f":"SUM(AC51:AC53)","v":29384494.53384757}]
[]
[null,null,null,null,null,null,null,null,null,null,null,null,null,null,null,null,"0-5",{"$f":"SUM(R8:R13)","v":101.7708197753803},{"$f":"SUM(S8:S13)","v":32.713217542713046},{"$f":"SUM(T8:T13)","v":120.06048372093024},{"$f":"SUM(U8:U13)","v":18.289663945549925},{"$f":"U56/T56","v":0.15233708359915157},null,{"$f":"SUM(X8:X13)","v":10177.081977538031},12006.048372093024,1828.9663945549926,14756768.867430143,17408770.139534887,2652001.2721047397]
[null,null,null,null,null,null,null,null,null,null,null,null,null,null,null,null,"6-23",{"$f":"SUM(R14:R31)","v":118.45141077096773},{"$f":"SUM(S14:S31)","v":38.075027570224279},{"$f":"SUM(T14:T31)","v":230.24930140930235},{"$f":"SUM(U14:U31)","v":111.79789063833456},0.48555148681905097,null,{"$f":"SUM(X14:X31)","v":11845.141077096774},23024.930140930235,11179.789063833456,17175454.561790321,33386148.70434884,16210694.142558513]
[null,null,null,null,null,null,null,null,null,null,null,null,null,null,null,null,null,{"$f":"SUM(R56:R57)","v":220.22223054634804},{"$f":"SUM(S56:S57)","v":70.788245112937318},350.30978513023257,130.0875545838845,0.37135004531923832,null,{"$f":"SUM(X56:X57)","v":22022.223054634807},{"$f":"SUM(Y56:Y57)","v":35030.978513023263},13008.755458388448,31932223.429220464,50794918.843883723,18862695.414663251]
[null,null,null,null,null,null,null,null,null,null,null,null,null,null,null,null,"*RTU, XYZ, AA, AAB , AAC"]

{"sheet":"Database","index":22,"n_rows":232,"n_cols":98,"rows_kept":232,"cut":false,"hidden":true,"merged":[]}
[null,"Country","Currency","Code","Date","Exchange Rate","currency control","ISO","Country ( to delete)","Country","UNICEF REGIONS 1","UN REGIONS","SDG regions","World Bank Income groups","Short Source",null,"YEAR","Country","Country code","Parent code","Reference date (as of 1 July)",2000,2001,2002,2003,2004,2005,2006,2007,2008,2009,2010,2011,2012,2013,2014,2015,2016,2017,2018,2019,2020,null,"2020-2025","2025-2030","2030-2035","2035-2040","2040-2045","2045-2050",null,"Countries","HDI Rank",2000,2001,2002,2003,2004,2005,2006,2007,2008,2009,2010,2011,2012,2013,2014,2015,2016,2017,2018,2019,null,"Countries","2000","2001","2002","2003","2004","2005","2006","2007","2008","2009","2010","2011","2012","2013","2014","2015","2016","2017","2018","2019","2020",null,"Countries","Classification by Income (UN)"]
[1,null,null,null,null,null,{"$f":"VLOOKUP('Country Data'!AD20,Database!B2:P232,15,TRUE)","v":101},null,null,null,null,null,null,null,null,1]
[2,"Afghanistan","Afghanistan Afghani                     ","AFN","2021-10-01",87.88,null,"AFG","Afghanistan","Afghan 2010_11","South Asia","Southern Asia","Central Asia and Southern Asia","Low-Income","Full data, Source: MICS",2,"2010-11","Afghanistan",4,5501,0,923,943,970,997,1021,1037,1059,1074,1085,1094,1105,1103,1102,1102,1104,1107,1118,1132,1146,1159,1169,null,6118.6180000000004,6156.6940000000004,6148.9080000000004,6086.7150000000001,5965.37,5791.2470000000003,null,"Afghanistan",169,0.35,0.35299999999999998,0.38400000000000001,0.39300000000000002,0.40899999999999997,0.41799999999999998,0.42899999999999999,0.44700000000000001,0.44700000000000001,0.46,0.47199999999999998,0.47699999999999998,0.48899999999999999,0.496,0.5,0.5,0.502,0.50600000000000001,0.50900000000000001,0.51100000000000001,null,"Afghanistan","..","..","..","..","..","..","..","..","..","..","..","..","..","..","..","..","..","..","..","..","..",null,"Afghanistan","Low Income"]
[3,"Albania","Albania Lek(e)                          ","ALL","2021-10-01",101.15,null,"ALB","Albania","Full data, Source: Full data, Source: DHS-Albania 2017-2018","Eastern Europe and Central Asia","Southern Europe","Northern America and Europe","Upper-Middle-Income","Full data, Source: DHS",3,"2017-18","Albania",8,925,0,51,49,46,44,41,39,38,36,35,35,35,35,36,38,39,39,38,36,34,33,31,null,157.078,135.125,115.896,105.55200000000001,100.733,96.298000000000002,null,"Albania",69,0.67100000000000004,0.67800000000000005,0.68400000000000005,0.69099999999999995,0.69599999999999995,0.70599999999999996,0.71299999999999997,0.72199999999999998,0.72799999999999998,0.73299999999999998,0.745,0.76400000000000001,0.77500000000000002,0.78200000000000003,0.78700000000000003,0.78800000000000003,0.78800000000000003,0.79,0.79200000000000004,0.79500000000000004,null,"Albania","..","..",14.1,"..","..",8.6999999999999993,"..","..",5.3,"..","..","..",6.2,"..",11.6,8.1999999999999993,9.4,8.1999999999999993,"..","..","..",null,"Albania","Upper Middle Income"]
[4,"Algeria","Algerian Dinar                          ","DZD","2021-10-01",136.37799999999999,null,"DZA","Algeria","Algeria 2018-2019","Middle East and North Africa","Northern Africa","Western Asia and Northern Africa","Lower-Middle Income","Full data, Source: MICS",4,"2018-19","Algeria",12,912,0,548,543,551,571,602,642,692,752,813,868,911,934,945,948,949,956,971,991,1009,1018,1011,null,4666.982,4215.817,4041.6129999999998,4188.8469999999998,4452.3580000000002,4576.4459999999999,null,"Algeria",91,0.63700000000000001,0.64700000000000002,0.65700000000000003,0.66700000000000004,0.67700000000000005,0.68500000000000005,0.69,0.7,0.70199999999999996,0.71099999999999997,0.72099999999999997,0.72799999999999998,0.72799999999999998,0.72899999999999998,0.73599999999999999,0.74,0.74299999999999999,0.745,0.746,0.748,null,"Algeria","..","..","..","..","..","..","..","..","..","..","..",3.7,"..","..","..","..","..","..","..","..","..",null,"Algeria","Upper Middle Income"]
[5,"American samoa","US Dollar                               ","USD","2021-10-01",1,null,"ASM",null,null,"Oceania",null,null,"Upper-Middle-Income","No data, regional estimates only ",5,null,"American samoa",null,null,null,null,null,null,null,null,null,null,null,null,null,null,null,null,null,null,null,null,null,null,null,1.4419999999999999,null,null,null,null,null,null,null,null,"American samoa",null,null,null,null,null,null,null,null,null,null,null,null,null,null,null,null,null,null,null,null,null,null,"American samoa",null,null,null,null,null,null,null,null,null,null,null,null,null,null,null,null,null,null,null,null,null,null,"American samoa"]
[6,"Andorra","Euro                                    ","EUR","2021-10-01",0.86,null,"AND",null,null,"Western Europe",null,null,"High-Income","No data",6,null,"Andorra",null,null,null,null,null,null,null,null,null,null,null,null,null,null,null,null,null,null,null,null,null,null,null,null,null,null,null,null,null,null,null,null,"Andorra",null,null,null,null,null,null,null,null,null,null,null,null,null,null,null,null,null,null,null,null,null,null,"Andorra",null,null,null,null,null,null,null,null,null,null,null,null,null,null,null,null,null,null,null,null,null,null,"Andorra"]
[7,"Angola","Angolan Kwanza                          ","AOA","2021-10-01",603.33000000000004,null,"AGO","Angola","Full data, Source: Full data, Source: DHS-Angola 2015-2016","Eastern and Southern Africa","Middle Africa","Sub-Saharan Africa","Lower-Middle Income","Full data, Source: DHS",7,"2015-16","Angola",24,911,0,677,701,726,753,783,815,847,881,915,949,979,1006,1031,1054,1076,1097,1118,1138,1160,1184,1211,null,6940.19,7769.2619999999997,8636.1270000000004,9475.25,10320.659,11118.279,null,"Angola",148,0.4,0.41,0.42599999999999999,0.435,0.44600000000000001,0.46,0.47299999999999998,0.48899999999999999,0.501,0.51500000000000001,0.51700000000000002,0.53300000000000003,0.54400000000000004,0.55500000000000005,0.56499999999999995,0.57199999999999995,0.57799999999999996,0.58199999999999996,0.58199999999999996,0.58099999999999996,null,"Angola",59.7,"..","..","..","..","..","..","..",60.6,"..","..","..","..","..","..","..","..","..",71.5,"..","..",null,"Angola","Lower Middle Income"]
[8,"Anguilla","E.C. Dollar                             ","XCD","2021-10-01",2.7,null,"AIA",null,null,"Latin America and Caribbean",null,null,"","No data",8,null,"Anguilla",null,null,null,null,null,null,null,null,null,null,null,null,null,null,null,null,null,null,null,null,null,null,null,null,null,null,null,null,null,null,null,null,"Anguilla",null,null,null,null,null,null,null,null,null,null,null,null,null,null,null,null,null,null,null,null,null,null,"Anguilla",null,null,null,null,null,null,null,null,null,null,null,null,null,null,null,null,null,null,null,null,null,null,"Anguilla"]
[9,"Antigua and Barbuda","E.C. Dollar                             ","XCD","2021-10-01",2.7,null,"ATG",null,null,"Latin America and Caribbean",null,null,"High-Income","No data, regional estimates only ",9,null,"Antigua and Barbuda",28,915,0,1,1,1,1,1,1,1,1,2,2,2,2,2,2,2,2,2,1,1,1,1,null,7.1189999999999998,6.8410000000000002,6.577,6.4489999999999998,6.3730000000000002,6.29,null,"Antigua and Barbuda",78,"..","..","..","..","..",0.76400000000000001,0.77100000000000002,0.77600000000000002,0.77400000000000002,0.76700000000000002,0.76300000000000001,0.755,0.75900000000000001,0.76,0.76,0.76200000000000001,0.76500000000000001,0.76800000000000002,0.77200000000000002,0.77800000000000002,null,"Antigua and Barbuda","..","..","..","..","..","..","..","..","..","..","..","..","..","..","..","..","..","..","..","..","..",null,"Antigua and Barbuda"]
[10,"Argentina","Argentine Peso                          ","ARS","2021-10-01",98.7,null,"ARG","Argentina","Full data, Source: MICS-Argentina  2019-2020","Latin America and Caribbean","South America","Latin America and the Caribbean","Upper-Middle-Income","Full data, Source: MICS",10,"2019-20","Argentina",32,931,0,684,690,701,714,726,733,735,732,726,723,723,727,735,744,752,757,757,755,750,745,741,null,3735.2440000000001,3694.8389999999999,3637.1990000000001,3585.2869999999998,3526.0169999999998,3469.0259999999998,null,"Argentina",46,0.78100000000000003,0.78600000000000003,0.78100000000000003,0.78600000000000003,0.78700000000000003,0.78800000000000003,0.81200000000000006,0.81699999999999995,0.82099999999999995,0.82099999999999995,0.82899999999999996,0.83499999999999996,0.83399999999999996,0.83499999999999996,0.83599999999999997,0.84,0.83899999999999997,0.84299999999999997,0.84199999999999997,0.84499999999999997,null,"Argentina",15.1,19.2,30.3,17.3,13.9,11.2,8.8000000000000007,7.2,7,6.1,4.9000000000000004,3.3,3.5,3.2,3.6,"..",3.6,3.2,4,4.9000000000000004,"..",null,"Argentina","Upper Middle Income"]
[11,"Armenia","Armenian Dram                           ","AMD","2021-10-01",482.25,null,"ARM","Armenia","Full data, Source: Full data, Source: DHS-Armenia 2015-2016","Eastern Europe and Central Asia","Western Asia","Western Asia and Northern Africa","Upper-Middle-Income","Full data, Source: DHS",11,"2015-2016","Armenia",51,922,0,34,34,36,39,41,43,44,44,44,44,43,43,43,43,43,42,42,41,40,40,39,null,182.90899999999999,160.67699999999999,151.72300000000001,154.25899999999999,158.24600000000001,154.108,null,"Armenia",81,0.66900000000000004,0.67300000000000004,0.68200000000000005,0.69099999999999995,0.7,0.71199999999999997,0.72599999999999998,0.74099999999999999,0.745,0.74199999999999999,0.747,0.751,0.75600000000000001,0.76200000000000001,0.76400000000000001,0.76800000000000002,0.76600000000000001,0.76900000000000002,0.77100000000000002,0.77600000000000002,null,"Armenia","..",47.4,43.8,39.700000000000003,29,19.5,15.5,13.8,9.3000000000000007,13.9,14.1,13.1,11.3,11.4,11.4,9.5,9.6,8.1,9.4,9.8000000000000007,"..",null,"Armenia","Upper Middle Income"]
[12,"Aruba","Aruban Guilder                          ","AWG","2021-10-01",1.79,null,"ABW",null,null,"Latin America and Caribbean",null,null,"High-Income","No data, regional estimates only ",12,null,"Aruba",533,915,0,1,1,1,1,1,1,1,1,1,1,1,1,1,1,1,1,1,1,1,1,1,null,6.4509999999999996,6.6779999999999999,6.6769999999999996,6.3230000000000004,5.94,5.7629999999999999,null,"Aruba",null,null,null,null,null,null,null,null,null,null,null,null,null,null,null,null,null,null,null,null,null,null,"Aruba","..","..","..","..","..","..","..","..","..","..","..","..","..","..","..","..","..","..","..","..","..",null,"Aruba"]
[13,"Australia","Australian Dollar                       ","AUD","2021-10-01",1.39,null,"AUS",null,null,"Oceania",null,null,"High-Income","Partial data, Source: National survey",13,"2010","Australia",36,927,0,242,240,239,241,246,253,264,277,291,303,310,313,311,307,304,304,310,318,328,335,339,null,1582.4680000000001,1562.7170000000001,1569.9159999999999,1615.6310000000001,1690.0840000000001,1758.5419999999999,null,"Australia",8,0.90300000000000002,0.90500000000000003,0.90700000000000003,0.90900000000000003,0.91100000000000003,0.90600000000000003,0.90900000000000003,0.91200000000000003,0.92600000000000005,0.92800000000000005,0.93,0.93200000000000005,0.93700000000000006,0.93100000000000005,0.93300000000000005,0.93799999999999994,0.93899999999999995,0.94099999999999995,0.94299999999999995,0.94399999999999995,null,"Australia","..",1,"..",1.2,0.7,"..","..","..",0.7,"..",0.7,"..","..","..",0.7,"..","..","..","..","..","..",null,"Australia","High Income"]
[14,"Austria","Euro                                    ","EUR","2021-10-01",0.86,null,"AUT",null,null,"Western Europe",null,null,"High-Income","Partial data, Source: National survey",14,"2006","Austria",40,926,0,72,72,73,76,79,81,81,80,79,78,77,77,78,79,81,83,85,87,89,91,92,null,450.24299999999999,436.983,416.80599999999998,401.47699999999998,398.93700000000001,406.33,null,"Austria",18,0.84699999999999998,0.85699999999999998,0.84699999999999998,0.85099999999999998,0.85799999999999998,0.86299999999999999,0.87,0.89,0.89300000000000002,0.89500000000000002,0.90400000000000003,0.90600000000000003,0.90800000000000003,0.90500000000000003,0.91300000000000003,0.91500000000000004,0.91700000000000004,0.91900000000000004,0.92100000000000004,0.92200000000000004,null,"Austria",0.2,"..","..",0.4,0.1,0.2,0.2,0.6,0.6,0.7,0.6,0.6,0.7,0.4,0.3,0.7,0.9,0.4,0.7,"..","..",null,"Austria","High Income"]
[15,"Azerbaijan","Azerbaijan Manat                        ","AZN","2021-10-01",1.6950000000000001,null,"AZE","Azerbaijan","Full data, Source: Full data, Source: DHS-Azerbajian 2006","Eastern Europe and Central Asia","Western Asia","Western Asia and Northern Africa","Upper-Middle-Income","Full data, Source: DHS",15,"2006","Azerbaijan",31,922,0,123,122,125,129,134,138,141,143,146,149,154,162,172,182,188,189,185,176,164,152,143,null,719.37199999999996,649.351,651.11,661.54,639.01700000000005,598.96199999999999,null,"Azerbaijan",88,0.63500000000000001,0.64300000000000002,0.65100000000000002,0.65900000000000003,0.66700000000000004,0.67400000000000004,0.70099999999999996,0.70599999999999996,0.71599999999999997,0.72699999999999998,0.72599999999999998,0.72699999999999998,0.73,0.73499999999999999,0.74,0.74399999999999999,0.751,0.754,0.754,0.75600000000000001,null,"Azerbaijan","..",16.7,0.6,0.9,0.2,"..","..","..","..","..","..","..","..","..","..","..","..","..","..","..","..",null,"Azerbaijan","Upper Middle Income"]
[16,"Bahamas","Bahamian Dollar                         ","BSD","2021-10-01",1,null,"BHS",null,null,"Latin America and Caribbean",null,null,"High-Income","No data, regional estimates only ",16,null,"Bahamas",44,915,0,5,5,5,5,5,6,6,6,6,6,6,6,6,5,5,5,5,5,5,6,6,null,27.222000000000001,27.271999999999998,26.690999999999999,25.951000000000001,25.484999999999999,24.981999999999999,null,"Bahamas",58,0.79700000000000004,0.79800000000000004,0.8,0.79900000000000004,0.8,0.80100000000000005,0.80400000000000005,0.80400000000000005,0.80400000000000005,0.80300000000000005,0.80500000000000005,0.80500000000000005,0.80700000000000005,0.80600000000000005,0.80500000000000005,0.80800000000000005,0.81,0.81200000000000006,0.81200000000000006,0.81399999999999995,null,"Bahamas","..","..","..","..","..","..","..","..","..","..","..","..","..","..","..","..","..","..","..","..","..",null,"Bahamas","High Income"]
[17,"Bahrain","Bahraini Dinar                          ","BHD","2021-10-01",0.377,null,"BHR",null,null,"Middle East and North Africa",null,null,"High-Income","No data, regional estimates only ",17,null,"Bahrain",48,922,0,14,14,14,14,15,15,16,17,18,19,19,20,21,21,22,22,21,21,20,20,19,null,111.265,112.039,112.09699999999999,106.66200000000001,100.914,97.716999999999999,null,"Bahrain",42,0.79500000000000004,0.79600000000000004,0.79500000000000004,0.79700000000000004,0.79600000000000004,0.79500000000000004,0.79700000000000004,0.79900000000000004,0.8,0.79800000000000004,0.8,0.80100000000000005,0.80800000000000005,0.81499999999999995,0.82,0.84799999999999998,0.85299999999999998,0.85399999999999998,0.85199999999999998,0.85199999999999998,null,"Bahrain","..","..","..","..","..","..","..","..","..","..","..","..","..","..","..","..","..","..","..","..","..",null,"Bahrain","High Income"]
[18,"Bangladesh","Bangladesh Taka                         ","BDT","2021-10-01",85.359399999999994,null,"BGD","Bangladesh","Bangla 2019","South Asia","Southern Asia","Central Asia and Southern Asia","Lower-Middle Income","Full data, Source: MICS",18,2019,"Bangladesh",50,5501,0,3327,3326,3317,3299,3269,3227,3179,3119,3057,3003,2966,2945,2941,2946,2952,2951,2940,2922,2900,2875,2849,null,14110.906999999999,13219.463,12346.04,11560.358,10912.846,10381.16,null,"Bangladesh",133,0.47799999999999998,0.48599999999999999,0.49199999999999999,0.499,0.50600000000000001,0.51400000000000001,0.52100000000000002,0.52800000000000002,0.53100000000000003,0.54300000000000004,0.55700000000000005,0.56599999999999995,0.57499999999999996,0.57899999999999996,0.57899999999999996,0.59499999999999997,0.60599999999999998,0.61599999999999999,0.625,0.63200000000000001,null,"Bangladesh",72.3,"..","..","..","..",65.8,"..","..","..","..",60,"..","..","..","..","..",52.3,"..","..","..","..",null,"Bangladesh","Lower Middle Income"]
[19,"Barbados","Barbados Dollar                         ","BBD","2021-10-01",2,null,"BRB","Barbados","Barbados 2012","Latin America and Caribbean","Caribbean","Latin America and the Caribbean","High-Income","Full data, Source: MICS",19,"2012","Barbados",52,915,0,3,3,3,4,4,4,4,4,3,3,3,3,3,3,3,3,3,3,3,3,3,null,15.208,15.132,14.811,14.141999999999999,13.321999999999999,12.688000000000001,null,"Barbados",58,0.77100000000000002,0.77,0.77400000000000002,0.77800000000000002,0.78200000000000003,0.78700000000000003,0.79100000000000004,0.79600000000000004,0.8,0.8,0.79700000000000004,0.79900000000000004,0.80800000000000005,0.80700000000000005,0.80800000000000005,0.80900000000000005,0.81100000000000005,0.81,0.81,0.81399999999999995,null,"Barbados","..","..","..","..","..","..","..","..","..","..","..","..","..","..","..","..","..","..","..","..","..",null,"Barbados","High Income"]
[20,"Belarus","Belarusian Ruble                        ","BYN","2021-10-01",2.5030000000000001,null,"BLR","Belarus","Belarus 2019","Eastern Europe and Central Asia","Eastern Europe","Northern America and Europe","Upper-Middle-Income","Full data, Source: MICS",20,"2019","Belarus",null,null,null,null,null,null,null,null,null,null,null,null,null,null,null,null,null,null,null,null,null,null,null,107.93,null,512.92200000000003,454.94400000000002,424.48399999999998,434.642,463.15899999999999,474.84199999999998,null,"Belarus",53,0.68600000000000005,0.69199999999999995,0.69899999999999995,0.70699999999999996,0.71699999999999997,0.72699999999999998,0.74399999999999999,0.76,0.77700000000000002,0.78700000000000003,0.79500000000000004,0.80100000000000005,0.80600000000000005,0.81100000000000005,0.81399999999999995,0.81399999999999995,0.81499999999999995,0.81899999999999995,0.82299999999999995,0.82299999999999995,null,"Belarus",27.8,15.6,11.4,9.4,4.7,2.7,1.2,1.1000000000000001,0.5,0.6,0.2,0.1,0.1,"..","..","..","..","..","..","..","..",null,"Belarus","Upper Middle Income"]
[21,"Belgium","Euro                                    ","EUR","2021-10-01",0.86,null,"BEL",null,null,"Western Europe",null,null,"High-Income","No data",21,null,"Belgium",56,926,0,108,108,110,113,116,120,123,126,128,130,131,131,129,128,126,124,123,122,122,122,122,null,618.15,604.23699999999997,598.83000000000004,605.11800000000005,614.13900000000001,612.38800000000003,null,"Belgium",14,0.88,0.88300000000000001,0.88600000000000001,0.88900000000000001,0.89300000000000002,0.89700000000000002,0.90400000000000003,0.90700000000000003,0.90600000000000003,0.90700000000000003,0.91,0.91100000000000003,0.91300000000000003,0.91600000000000004,0.91800000000000004,0.92200000000000004,0.92400000000000004,0.92900000000000005,0.93,0.93100000000000005,null,"Belgium",0.7,"..","..",0.5,0.1,0.3,0.2,0.2,0.1,0.2,0.2,0.3,0.2,0.2,0.1,0.2,0.1,0.2,0.1,"..","..",null,"Belgium","High Income"]
[22,"Belize","Belize Dollar                           ","BZD","2021-10-01",2,null,"BLZ","Belize","Belize 2011","Latin America and Caribbean","Central America","Latin America and the Caribbean","Lower-Middle Income","Full data, Source: MICS",22,"2011","Belize",84,916,0,8,8,8,7,7,7,7,7,7,7,7,7,8,8,8,8,8,8,8,8,8,null,40.786999999999999,40.465000000000003,39.441000000000003,38.334000000000003,37.372999999999998,36.534999999999997,null,"Belize",110,0.64,0.64400000000000002,0.65100000000000002,0.65900000000000003,0.66500000000000004,0.66200000000000003,0.67200000000000004,0.67400000000000004,0.67900000000000005,0.68400000000000005,0.69499999999999995,0.69399999999999995,0.70099999999999996,0.70199999999999996,0.70499999999999996,0.71,0.71699999999999997,0.71399999999999997,0.71399999999999997,0.71599999999999997,null,"Belize","..","..","..","..","..","..","..","..","..","..","..","..","..","..","..","..","..","..","..","..","..",null,"Belize","Upper Middle Income"]
[23,"Benin","CFA Franc                               ","XOF","2021-10-01",563.97299999999996,null,"BEN","Benin","Full data, Source: Full data, Source: DHS-Benin 2017-2018","West and Central Africa","Western Africa","Sub-Saharan Africa","Lower-Middle Income","Full data, Source: DHS",23,"2017-2018","Benin",204,914,0,263,268,274,281,288,295,303,311,319,327,335,342,348,355,361,368,374,380,387,394,401,null,2241.2750000000001,2424.2220000000002,2604.1239999999998,2774.413,2931.317,3079.7370000000001,null,"Benin",158,0.41599999999999998,0.42799999999999999,0.438,0.44500000000000001,0.45300000000000001,0.45900000000000002,0.46700000000000003,0.47499999999999998,0.48199999999999998,0.48799999999999999,0.49399999999999999,0.5,0.51,0.52200000000000002,0.52700000000000002,0.53200000000000003,0.53300000000000003,0.53600000000000003,0.54100000000000004,0.54500000000000004,null,"Benin","..","..","..",79.8,"..","..","..","..","..","..","..",76.8,"..","..","..",76.2,"..","..","..","..","..",null,"Benin","Low income"]
[24,"Bermuda","Bermuda Dollar                          ","BMD","2021-10-01",1,null,"BMU",null,null,"North America",null,null,"High-Income","No data",24,null,"Bermuda",null,null,null,null,null,null,null,null,null,null,null,null,null,null,null,null,null,null,null,null,null,null,null,null,null,null,null,null,null,null,null,null,"Bermuda",null,null,null,null,null,null,null,null,null,null,null,null,null,null,null,null,null,null,null,null,null,null,"Bermuda",null,null,null,null,null,null,null,null,null,null,null,null,null,null,null,null,null,null,null,null,null,null,"Bermuda"]
[25,"Bhutan","Bhutan Ngultrum                         ","BTN","2021-10-01",74.150000000000006,null,"BTN","Bhutan","Bhutan 2010","South Asia","Southern Asia","Central Asia and Southern Asia","Lower-Middle Income","Full data, Source: MICS",25,2010,"Bhutan",64,5501,0,15,15,15,14,14,14,14,14,14,13,13,13,13,12,12,12,12,13,13,13,13,null,62.393999999999998,57.466999999999999,52.218000000000004,47.795000000000002,45.143999999999998,43.481999999999999,null,"Bhutan",129,"..","..","..","..","..",0.52,0.52600000000000002,0.54200000000000004,0.55100000000000005,0.56100000000000005,0.57399999999999995,0.58499999999999996,0.59699999999999998,0.61,0.61799999999999999,0.628,0.63700000000000001,0.64600000000000002,0.64900000000000002,0.65400000000000003,null,"Bhutan","..","..","..",45.3,"..","..","..",30.6,"..","..","..","..",14.7,"..","..","..","..",12.2,"..","..","..",null,"Bhutan","Lower Middle Income"]
[26,"Bolivia (Plurinational State of)","Bolivia Boliviano                       ","BOB","2021-10-01",6.835,null,"BOL","Bolivia (Plurinational State of)","Full data, Source: Full data, Source: DHS-Bolivia 2008","Latin America and Caribbean","South America","Latin America and the Caribbean","Lower-Middle Income","Full data, Source: DHS",26,"2008","Bolivia (Plurinational State of)",68,931,0,239,241,242,243,244,244,243,242,240,239,238,239,240,241,243,243,242,241,239,237,237,null,1244.076,1244.704,1229.8820000000001,1210.461,1183.123,1156.191,null,"Bolivia (Plurinational State of)",107,0.627,0.63,0.63700000000000001,0.64,0.64100000000000001,0.64300000000000002,0.64900000000000002,0.64900000000000002,0.65800000000000003,0.66300000000000003,0.66700000000000004,0.67100000000000004,0.67500000000000004,0.68400000000000005,0.69,0.69699999999999995,0.70199999999999996,0.71,0.71399999999999997,0.71799999999999997,null,"Bolivia (Plurinational State of)",41.3,36.1,38.200000000000003,"..",28.9,32,28.5,26.3,20,18.3,"..",14,14.6,12.2,12.1,11.6,13.1,12.4,11,7.8,"..",null,"Bolivia (Plurinational State of)","Lower Middle Income"]
[27,"Bosnia and Herzegovina","Bosnia and Herzegovina Convertible Mark ","BAM","2021-10-01",1.6819999999999999,null,"BIH","Bosnia and Herzegovina","Bosnia 2012","Eastern Europe and Central Asia","Southern Europe","Northern America and Europe","Upper-Middle-Income","Full data, Source: MICS",27,"2012","Bosnia and Herzegovina",70,925,0,47,44,39,34,30,28,29,32,36,39,40,39,37,33,30,27,26,25,25,25,25,null,121.063,114.533,112.322,110.361,106.282,98.616,null,"Bosnia and Herzegovina",73,0.67900000000000005,0.68400000000000005,0.68899999999999995,0.69499999999999995,0.70099999999999996,0.70599999999999996,0.71199999999999997,0.71899999999999997,0.72599999999999998,0.72699999999999998,0.72099999999999997,0.72899999999999998,0.748,0.755,0.75800000000000001,0.76100000000000001,0.77200000000000002,0.77400000000000002,0.77700000000000002,0.78,null,"Bosnia and Herzegovina","..",0.9,"..","..",0.6,"..","..",0.4,"..","..","..",0.7,"..","..","..","..","..","..","..","..","..",null,"Bosnia and Herzegovina","Upper Middle Income"]
[28,"Botswana","Botswana Pula                           ","BWP","2021-10-01",11.298999999999999,null,"BWA","Botswana","Botswana 2000","Eastern and Southern Africa","Southern Africa","Sub-Saharan Africa","Upper-Middle-Income","Full data, Source: MICS",28,"2000","Botswana",72,913,0,43,44,46,47,49,50,51,51,52,52,52,53,54,54,55,55,55,55,54,54,53,null,273.93400000000003,273.69099999999997,277.90600000000001,281.83999999999997,280.74299999999999,275.33999999999997,null,"Botswana",100,0.58099999999999996,0.58199999999999996,0.57899999999999996,0.58599999999999997,0.59199999999999997,0.60099999999999998,0.61499999999999999,0.628,0.64100000000000001,0.65,0.66300000000000003,0.67700000000000005,0.68899999999999995,0.70099999999999996,0.71099999999999997,0.71699999999999997,0.72,0.72599999999999998,0.73,0.73499999999999999,null,"Botswana","..","..",48.7,"..","..","..","..","..","..",35.5,"..","..","..","..","..",36.5,"..","..","..","..","..",null,"Botswana","Upper Middle Income"]
[29,"Brazil","Brazilian Real                          ","BRL","2021-10-01",5.4290000000000003,null,"BRA",null,null,"Latin America and Caribbean",null,null,"Upper-Middle-Income","Progress in breastfeeding…",29,"2019","Brazil",76,931,0,3533,3466,3375,3271,3170,3085,3021,2973,2940,2921,2913,2920,2938,2960,2979,2988,2984,2971,2946,2913,2871,null,13816.602000000001,12926.031000000001,12225.188,11590.865,11092.003000000001,10717.106,null,"Brazil",84,0.68500000000000005,0.69099999999999995,0.69899999999999995,0.69499999999999995,0.69799999999999995,0.7,0.70199999999999996,0.70599999999999996,0.71699999999999997,0.71899999999999997,0.72699999999999998,0.73099999999999998,0.73499999999999999,0.753,0.75600000000000001,0.75600000000000001,0.75800000000000001,0.76100000000000001,0.76200000000000001,0.76500000000000001,null,"Brazil","..",23.3,22.3,23.3,21.4,19.600000000000001,17,15.6,13.4,12.4,"..",10.199999999999999,9,7.9,7,7.7,8.8000000000000007,9.1,9.1,9.1,"..",null,"Brazil","Upper Middle Income"]
[30,"British Virgin Island","US Dollar","USD","2021-10-01",1,null,"VGB",null,null,"Latin America and Caribbean",null,null,"High-Income","No data, regional estimates only ",30,null,"British Virgin Island",null,null,null,null,null,null,null,null,null,null,null,null,null,null,null,null,null,null,null,null,null,null,null,0.437,null,null,null,null,null,null,null,null,"British Virgin Island",null,null,null,null,null,null,null,null,null,null,null,null,null,null,null,null,null,null,null,null,null,null,"British Virgin Island",null,null,null,null,null,null,null,null,null,null,null,null,null,null,null,null,null,null,null,null,null,null,"British Virgin Island"]
[31,"Brunei Darussalam","Brunei Dollar                           ","BND","2021-10-01",1.359,null,"BRN",null,null,"Southeastern Asia",null,null,"High-Income","No data, regional estimates only  ",31,null,"Brunei Darussalam",96,920,0,7,7,7,7,6,6,6,6,6,6,6,6,7,7,8,8,7,7,6,6,5,null,29.771999999999998,27.908999999999999,26.382999999999999,25.478999999999999,25.033999999999999,24.373000000000001,null,"Brunei Darussalam",47,0.80200000000000005,0.80300000000000005,0.80700000000000005,0.81299999999999994,0.81799999999999995,0.82199999999999995,0.82499999999999996,0.82499999999999996,0.82499999999999996,0.82699999999999996,0.82699999999999996,0.83099999999999996,0.83899999999999997,0.83899999999999997,0.83799999999999997,0.83799999999999997,0.83899999999999997,0.83799999999999997,0.83599999999999997,0.83799999999999997,null,"Brunei Darussalam","..","..","..","..","..","..","..","..","..","..","..","..","..","..","..","..","..","..","..","..","..",null,"Brunei Darussalam","High Income"]
[32,"Bulgaria","Bulgarian Lev                           ","BGN","2021-10-01",1.6819999999999999,null,"BGR",null,null,"Eastern Europe and Central Asia",null,null,"Upper-Middle-Income","No data, regional estimates only ",32,null,"Bulgaria",100,923,0,61,63,67,70,74,77,80,81,82,81,79,75,70,64,59,56,56,58,61,63,64,null,294.97500000000002,277.63799999999998,266.48899999999998,262.11799999999999,258.33699999999999,249.74700000000001,null,"Bulgaria",56,0.72,0.73,0.73599999999999999,0.745,0.752,0.75800000000000001,0.76500000000000001,0.77300000000000002,0.78,0.78200000000000003,0.78800000000000003,0.79100000000000004,0.79500000000000004,0.80100000000000005,0.80600000000000005,0.80900000000000005,0.81100000000000005,0.81100000000000005,0.81299999999999994,0.81599999999999995,null,"Bulgaria","..","..","..","..","..","..",11,4.8,3.4,2.9,4.4000000000000004,5,5.4,5,3.9,6,4.5999999999999996,3.3,2.2000000000000002,"..","..",null,"Bulgaria","Upper Middle Income"]
[33,"Burkina Faso","CFA Franc                               ","XOF","2021-10-01",563.97299999999996,null,"BFA","Burkina Faso","Burkina Faso 2006","West and Central Africa","Western Africa","Sub-Saharan Africa","Low-Income","Full data, Source: MICS",33,"2006","Burkina Faso",854,914,0,479,491,503,516,529,543,557,571,585,600,613,623,632,642,651,662,674,688,702,717,731,null,4029.1350000000002,4364.7979999999998,4694.2650000000003,4992.2169999999996,5247.7569999999996,5478.143,null,"Burkina Faso",182,0.29299999999999998,0.29799999999999999,0.30299999999999999,0.31,0.32,0.33200000000000002,0.34100000000000003,0.35199999999999998,0.36399999999999999,0.373,0.38400000000000001,0.39400000000000002,0.40300000000000002,0.41,0.41299999999999998,0.42199999999999999,0.42799999999999999,0.439,0.443,0.45200000000000001,null,"Burkina Faso","..","..","..",80.5,"..","..","..","..","..",81.8,"..","..","..","..",76.7,"..","..","..","..","..","..",null,"Burkina Faso","Low income"]
[34,"Burundi","Burundi Franc                           ","BIF","2021-10-01",1974.298,null,"BDI","Burundi","Full data, Source: Full data, Source: DHS-Burundi 2016-2017","Eastern and Southern Africa","Eastern Africa","Sub-Saharan Africa","Low-Income","Full data, Source: DHS",34,"2016-17","Burundi",108,910,0,240,245,254,266,279,292,304,315,327,338,349,359,369,379,388,396,402,407,412,417,423,null,2329.38,2491.5129999999999,2674.056,2874.4569999999999,3073.47,3251.8890000000001,null,"Burundi",185,0.3,0.30099999999999999,0.311,0.31900000000000001,0.33,0.33700000000000002,0.35899999999999999,0.371,0.38400000000000001,0.40100000000000002,0.41099999999999998,0.41899999999999998,0.42599999999999999,0.432,0.438,0.437,0.438,0.434,0.43099999999999999,0.433,null,"Burundi","..","..","..","..","..","..",93.1,"..","..","..","..","..","..",89.6,"..","..","..","..","..","..","..",null,"Burundi","Low income"]
[35,"Cabo Verde","Cape Verde Escudo                       ","CVE","2021-10-01",94.802999999999997,null,"CPV",null,null,"West and Central Africa",null,null,"Lower-Middle Income","No data, regional estimates only  ",35,null,"Cabo Verde",132,914,0,11,11,11,11,12,12,12,11,11,11,10,10,11,11,11,11,11,11,11,10,10,null,50.19,46.95,44.734000000000002,43.201000000000001,41.84,40.286999999999999,null,"Cabo Verde",126,0.56899999999999995,0.57299999999999995,0.58299999999999996,0.58799999999999997,0.59,0.59599999999999997,0.61099999999999999,0.61699999999999999,0.625,0.63,0.63200000000000001,0.63900000000000001,0.64400000000000002,0.64700000000000002,0.65400000000000003,0.65600000000000003,0.65700000000000003,0.66,0.66300000000000003,0.66500000000000004,null,"Cabo Verde","..",38.1,"..","..","..","..","..",26.9,"..","..","..","..","..","..","..",15.4,"..","..","..","..","..",null,"Cabo Verde","Lower Middle Income"]
[36,"Cambodia","Cambodian Riel                          ","KHR","2021-10-01",4112,null,"KHM","Cambodia","Full data, Source: Full data, Source: DHS-Cambodia 2014","Southeastern Asia","South-Eastern Asia","Eastern Asia and South-eastern Asia","Lower-Middle Income","Full data, Source: DHS",36,"2014","Cambodia",116,920,0,292,292,297,306,316,327,337,348,358,366,370,369,365,358,353,349,348,349,351,353,353,null,1760.78,1700.202,1688.4179999999999,1688.5,1652.0709999999999,1589.4839999999999,null,"Cambodia",144,0.42399999999999999,0.438,0.45700000000000002,0.47,0.48199999999999998,0.49399999999999999,0.50600000000000001,0.52,0.52500000000000002,0.52800000000000002,0.53900000000000003,0.54600000000000004,0.55200000000000005,0.55900000000000005,0.56499999999999995,0.56999999999999995,0.57599999999999996,0.58199999999999996,0.58499999999999996,0.59399999999999997,null,"Cambodia","..","..","..","..","..","..","..","..","..","..","..","..","..","..","..","..","..","..","..","..","..",null,"Cambodia","Lower Middle Income"]
[37,"Cameroon","CFA Franc                               ","XAF","2021-10-01",563.97299999999996,null,"CMR","Cameroon","Cameron 2016","West and Central Africa","Middle Africa","Sub-Saharan Africa","Lower-Middle Income","Full data, Source: MICS",37,"2016","Cameroon",120,911,0,567,584,604,625,646,665,682,697,711,724,738,750,763,776,788,800,810,821,831,842,854,null,4717.3739999999998,5021.6130000000003,5316.2349999999997,5602.3339999999998,5866.4560000000001,6109.7910000000002,null,"Cameroon",153,0.44,0.45600000000000002,0.45800000000000002,0.46400000000000002,0.46899999999999997,0.47,0.47099999999999997,0.48199999999999998,0.49,0.498,0.505,0.51400000000000001,0.52500000000000002,0.53400000000000003,0.54,0.54900000000000004,0.55300000000000005,0.55700000000000005,0.56000000000000005,0.56299999999999994,null,"Cameroon","..",55.8,"..","..","..","..","..",58.4,"..","..","..","..","..","..",47,"..","..","..","..","..","..",null,"Cameroon","Lower Middle Income"]
[38,"Canada","Canadian Dollar                         ","CAD","2021-10-01",1.272,null,"CAN",null,null,"North America",null,null,"High-Income","Partial data, Source: National survey",38,"2011-12","Canada",124,918,0,319,315,318,325,335,345,357,370,382,391,395,394,387,378,370,366,370,377,387,396,402,null,1940.62,1952.1980000000001,1967.902,2011.586,2077.5500000000002,2150.982,null,"Canada",16,0.86699999999999999,0.871,0.877,0.88200000000000001,0.88800000000000001,0.89400000000000002,0.89800000000000002,0.89600000000000002,0.89800000000000002,0.89800000000000002,0.90100000000000002,0.90300000000000002,0.90600000000000003,0.91300000000000003,0.91800000000000004,0.92100000000000004,0.92300000000000004,0.92600000000000005,0.92800000000000005,0.92900000000000005,null,"Canada",0.5,"..","..","..",0.2,"..","..",0.2,"..","..",0.2,"..",0.2,0.5,0.5,0.5,0.5,0.5,"..","..","..",null,"Canada","High Income"]
[39,"Cayman Island","Cayman Is. Dollar                       ","KYD","2021-10-01",0.82,null,"CYM",null,null,"Latin America and Caribbean",null,null,"High-Income","No data, regional estimates only ",39,null,"Cayman Island",null,null,null,null,null,null,null,null,null,null,null,null,null,null,null,null,null,null,null,null,null,null,null,0.8,null,null,null,null,null,null,null,null,"Cayman Island",null,null,null,null,null,null,null,null,null,null,null,null,null,null,null,null,null,null,null,null,null,null,"Cayman Island",null,null,null,null,null,null,null,null,null,null,null,null,null,null,null,null,null,null,null,null,null,null,"Cayman Island"]
[40,"Central African Republic","CFA Franc                               ","XAF","2021-10-01",563.97299999999996,null,"CAF","Central African Republic","CAR2018_19","West and Central Africa","Middle Africa","Sub-Saharan Africa","Low-Income","Full data, Source: MICS",40,"2018-19","Central African Republic",140,911,0,135,138,140,143,145,147,149,151,153,155,154,154,153,152,151,150,149,148,149,151,153,null,876.76300000000003,935.67600000000004,967.90700000000004,972.39300000000003,966.423,963.322,null,"Central African Republic",188,0.32500000000000001,0.32700000000000001,0.32800000000000001,0.32800000000000001,0.33100000000000002,0.33600000000000002,0.34200000000000003,0.34699999999999998,0.35199999999999998,0.35599999999999998,0.36499999999999999,0.374,0.38100000000000001,0.36299999999999999,0.36799999999999999,0.375,0.38200000000000001,0.39100000000000001,0.39500000000000002,0.39700000000000002,null,"Central African Republic","..","..","..","..","..","..","..","..",82.9,"..","..","..","..","..","..","..","..","..","..","..","..",null,"Central African Republic","Low income"]
[41,"Chad","CFA Franc                               ","XAF","2021-10-01",563.97299999999996,null,"TCD","Chad","Chad 2019","West and Central Africa","Middle Africa","Sub-Saharan Africa","Low-Income","Full data, Source: MICS",41,"2019","Chad",148,911,0,373,387,401,416,430,443,456,468,479,490,502,514,526,538,551,563,575,587,600,612,624,null,3530.96,3800.625,4043.337,4252.2550000000001,4441.424,4594.5519999999997,null,"Chad",187,0.29299999999999998,0.30099999999999999,0.307,0.30499999999999999,0.32400000000000001,0.32700000000000001,0.33,0.34,0.34599999999999997,0.36099999999999999,0.36899999999999999,0.38,0.38800000000000001,0.39400000000000002,0.40100000000000002,0.39800000000000002,0.39300000000000002,0.39600000000000002,0.39700000000000002,0.39800000000000002,null,"Chad","..","..","..",83.7,"..","..","..","..","..","..","..",66.3,"..","..","..","..","..","..","..","..","..",null,"Chad","Low income"]
[42,"Channel Islands","Jersey Pound","JEP","2021-10-01",1.3468599999999999,null,"GB",null,null,"Western Europe",null,null,"High-Income","No data",42,null,"Channel Islands",830,924,0,2,2,2,2,2,2,2,2,2,2,2,2,2,2,2,2,2,2,2,2,2,null,8.6660000000000004,8.73,8.7170000000000005,8.7550000000000008,8.9009999999999998,9.0579999999999998,null,"Channel Islands",null,null,null,null,null,null,null,null,null,null,null,null,null,null,null,null,null,null,null,null,null,null,"Channel Islands","..","..","..","..","..","..","..","..","..","..","..","..","..","..","..","..","..","..","..","..","..",null,"Channel Islands"]
[43,"Chile","Chilean Peso                            ","CLP","2021-10-01",803,null,"CHL",null,null,"Latin America and Caribbean",null,null,"High-Income","Partial data: Source: Health records",43,"2011-12","Chile",152,931,0,242,238,236,237,239,241,244,247,250,253,255,255,254,252,249,245,239,232,224,218,214,null,1117.4190000000001,1047.2539999999999,1002.55,976.32100000000003,962.99400000000003,947.24800000000005,null,"Chile",43,0.75600000000000001,0.76700000000000002,0.76900000000000002,0.77600000000000002,0.78500000000000003,0.79100000000000004,0.79100000000000004,0.80400000000000005,0.81399999999999995,0.82199999999999995,0.80300000000000005,0.81499999999999995,0.82099999999999995,0.82599999999999996,0.83699999999999997,0.84199999999999997,0.84499999999999997,0.84699999999999998,0.84899999999999998,0.85099999999999998,null,"Chile",12.1,"..","..",11.2,"..","..",5.4,"..","..",4,"..",2.6,"..",1.3,"..",1,"..",0.7,"..","..","..",null,"Chile","High Income"]
[44,"China","Chinese Renminbi                        ","CNY","2021-10-01",6.4660000000000002,null,"CHN",null,null,"Northeast Asia  ",null,null,"Upper-Middle-Income","No data",44,null,"China",156,906,0,20546,20657,19790,18345,16945,16057,15823,16036,16535,17067,17447,17638,17707,17670,17565,17422,17247,17022,16753,16447,16113,null,77100.153000000006,71651.553,69185.536999999997,67936.660999999993,66990.303,64979.985999999997,null,"China",85,0.58799999999999997,0.59599999999999997,0.60599999999999998,0.61799999999999999,0.628,0.64,0.65300000000000002,0.66700000000000004,0.67800000000000005,0.68700000000000006,0.69899999999999995,0.70699999999999996,0.71599999999999997,0.72399999999999998,0.73099999999999998,0.73899999999999999,0.746,0.75,0.755,0.76100000000000001,null,"China","..","..",57.7,"..","..",43.2,"..","..",34.700000000000003,"..",28.6,23.5,20.2,12.1,9.5,7,5.4,"..","..","..","..",null,"China","Upper Middle Income"]
[45,"China, Hong Kong SAR","HongKong Dollar                         ","HKD","2021-10-01",7.7839999999999998,null,"HKG",null,null,"Northeast Asia  ",null,null,"High-Income","No data, regional estimates only ",45,null,"China, Hong Kong SAR",344,906,0,43,40,37,36,35,36,39,42,46,50,52,52,50,48,47,49,54,62,70,77,81,null,411.66,385.423,340.13299999999998,303.81299999999999,296.17599999999999,313.57499999999999,null,"China, Hong Kong SAR",4,0.83,0.83799999999999997,0.84499999999999997,0.85399999999999998,0.86499999999999999,0.874,0.88600000000000001,0.89,0.89900000000000002,0.90100000000000002,0.90400000000000003,0.90700000000000003,0.91400000000000003,0.91800000000000004,0.92600000000000005,0.93,0.93600000000000005,0.94099999999999995,0.94599999999999995,0.94899999999999995,null,"China, Hong Kong SAR","..","..","..","..","..","..","..","..","..","..","..","..","..","..","..","..","..","..","..","..","..",null,"China, Hong Kong SAR","High Income"]
[46,"China, Macao SAR","Macao Pataca                            ","MOP","2021-10-01",8.0039999999999996,null,"MAC",null,null,"Northeast Asia  ",null,null,"High-Income","No data, regional estimates only ",46,null,"China, Macao SAR",446,906,0,4,4,3,3,3,3,4,4,5,5,6,6,6,7,7,7,7,7,7,7,7,null,34.142000000000003,30.631,28.361999999999998,29.702999999999999,33.344999999999999,36.698,null,"China, Macao SAR",null,null,null,null,null,null,null,null,null,null,null,null,null,null,null,null,null,null,null,null,null,null,"China, Macao SAR","..","..","..","..","..","..","..","..","..","..","..","..","..","..","..","..","..","..","..","..","..",null,"China, Macao SAR"]
[47,"China, Taiwan Province of China","New Taiwan Dollar","TWD","2021-10-01",3.6069999999999998E-2,null,"TWN",null,null,"Northeast Asia  ",null,null,"High-Income","No data, regional estimates only ",47,null,"China, Taiwan Province of China",158,906,0,269,253,238,227,216,207,198,190,185,182,185,193,205,218,228,232,227,216,202,189,182,null,1001.741,990.35199999999998,947.99,864.49900000000002,794.71,783.74599999999998,null,"China, Taiwan Province of China",null,null,null,null,null,null,null,null,null,null,null,null,null,null,null,null,null,null,null,null,null,null,"China, Taiwan Province of China",null,null,null,null,null,null,null,null,null,null,null,null,null,null,null,null,null,null,null,null,null,null,"China, Taiwan Province of China","High Income"]
[48,"Colombia","Colombian Peso                          ","COP","2021-10-01",3834,null,"COL",null,null,"Latin America and Caribbean",null,null,"Upper-Middle-Income","No data, regional estimates only ",48,null,"Colombia",170,931,0,837,833,837,843,845,838,820,794,764,739,722,716,718,726,737,747,753,759,762,760,750,null,3542.5709999999999,3292.5740000000001,3112.7460000000001,2961.4670000000001,2839.5050000000001,2740.547,null,"Colombia",83,0.66600000000000004,0.66800000000000004,0.67100000000000004,0.67,0.68400000000000005,0.68899999999999995,0.69799999999999995,0.71099999999999997,0.71799999999999997,0.72,0.72899999999999998,0.73399999999999999,0.73899999999999999,0.74199999999999999,0.753,0.75600000000000001,0.76,0.76300000000000001,0.76400000000000001,0.76700000000000002,null,"Colombia",31.4,37.700000000000003,28.5,27.7,26.9,23.9,"..","..",22.6,20.7,18.5,16.5,15.6,14.2,13.2,11.9,11.8,11.1,11.1,12.7,"..",null,"Colombia","Upper Middle Income"]
[49,"Comoros","Comoros Franc                           ","KMF","2021-10-01",422.98,null,"COM","Comoros","Comoros 2000","Eastern and Southern Africa","Eastern Africa","Sub-Saharan Africa","Lower-Middle Income","Full data, Source: MICS",49,"2000","Comoros",174,910,0,19,19,19,20,20,21,21,21,22,22,23,23,24,24,24,25,25,25,25,25,25,null,137.06100000000001,142.08799999999999,147.67099999999999,153.054,157.79,161.07900000000001,null,"Comoros",156,0.46500000000000002,0.47,0.47499999999999998,0.48099999999999998,0.48299999999999998,0.48899999999999999,0.495,0.501,0.50800000000000001,0.51400000000000001,0.52100000000000002,0.53300000000000003,0.53800000000000003,0.54200000000000004,0.54300000000000004,0.54500000000000004,0.54700000000000004,0.55000000000000004,0.55200000000000005,0.55400000000000005,null,"Comoros","..","..","..","..",37.4,"..","..","..","..","..","..","..","..","..",39.700000000000003,"..","..","..","..","..","..",null,"Comoros","Lower Middle Income"]
[50,"Congo","CFA Franc                               ","XAF","2021-10-01",563.97299999999996,null,"COG","Congo","Congo 2014-2015","West and Central Africa","Middle Africa","Sub-Saharan Africa","Lower-Middle Income","Full data, Source: MICS",50,"2014-2015","Congo",178,911,0,111,114,117,120,124,128,133,138,143,148,151,155,157,159,160,161,162,162,163,165,167,null,917.255,1000.534,1091.308,1173.6420000000001,1247.3779999999999,1312.347,null,"Congo",149,0.46100000000000002,0.46800000000000003,0.47099999999999997,0.47099999999999997,0.47299999999999998,0.46899999999999997,0.47,0.48599999999999999,0.501,0.51400000000000001,0.52,0.52200000000000002,0.53500000000000003,0.54500000000000004,0.56000000000000005,0.57999999999999996,0.57799999999999996,0.57399999999999995,0.57299999999999995,0.57399999999999995,null,"Congo","..","..","..","..","..",76.2,"..","..","..","..","..",64.099999999999994,"..","..","..","..","..","..","..","..","..",null,"Congo"]
[51,"Cook Island","New Zealand Dollar                      ","NZD","2021-10-01",1.452,null,"COK",null,null,"Oceania",null,null,"","No data",51,null,"Cook Island",null,null,null,null,null,null,null,null,null,null,null,null,null,null,null,null,null,null,null,null,null,null,null,null,null,null,null,null,null,null,null,null,"Cook Island",null,null,null,null,null,null,null,null,null,null,null,null,null,null,null,null,null,null,null,null,null,null,"Cook Island",null,null,null,null,null,null,null,null,null,null,null,null,null,null,null,null,null,null,null,null,null,null,"Cook Island"]
[52,"Costa Rica","Costa Rica Colon                        ","CRC","2021-10-01",622.02,null,"CRI","Costa Rica","CostaRica2018","Latin America and Caribbean","Central America","Latin America and the Caribbean","Upper-Middle-Income","Full data, Source: MICS",52,"2018","Costa Rica",188,916,0,77,76,74,72,70,69,69,70,71,72,73,74,73,73,72,72,71,70,69,68,68,null,329.97800000000001,308.58800000000002,295.47300000000001,285.16199999999998,276.99099999999999,269.41399999999999,null,"Costa Rica",62,0.72099999999999997,0.72499999999999998,0.72799999999999998,0.73099999999999998,0.73499999999999999,0.73799999999999999,0.745,0.753,0.76100000000000001,0.76200000000000001,0.76500000000000001,0.77800000000000002,0.78300000000000003,0.78800000000000003,0.79600000000000004,0.79700000000000004,0.80100000000000005,0.80400000000000005,0.80800000000000005,0.81,null,"Costa Rica",13.9,10.9,9.9,9.9,9.3000000000000007,8,7.8,5.4,5.3,5.7,4.2,4.4000000000000004,4.3,4.2,4,4.0999999999999996,3.8,2.8,3.7,3.2,"..",null,"Costa Rica","Upper Middle Income"]
[53,"Côte d'Ivoire","CFA Franc                               ","XOF","2021-10-01",563.97299999999996,null,"CIV","Côte d'Ivoire","Cote d'Ivoire 2006","West and Central Africa","Western Africa","Sub-Saharan Africa","Lower-Middle Income","Full data, Source: MICS",53,"2006","Côte d'Ivoire",384,914,0,609,622,633,642,650,657,663,668,674,683,696,712,731,753,775,795,812,828,842,856,870,null,4831.4620000000004,5199.2520000000004,5546.1130000000003,5897.0739999999996,6242.3320000000003,6573.366,null,"Côte d'Ivoire",162,0.42099999999999999,0.42399999999999999,0.42599999999999999,0.42899999999999999,0.433,0.438,0.443,0.44900000000000001,0.45500000000000002,0.46200000000000002,0.46800000000000003,0.47199999999999998,0.48199999999999998,0.49,0.49199999999999999,0.503,0.51300000000000001,0.52500000000000002,0.53400000000000003,0.53800000000000003,null,"Côte d'Ivoire","..","..",58.1,"..","..","..","..","..",59.1,"..","..","..","..","..","..",59.1,"..","..","..","..","..",null,"Côte d'Ivoire","Lower Middle Income"]
[54,"Croatia","Croatia Kuna                            ","HRK","2021-10-01",6.4390000000000001,null,"HRV",null,null,"Eastern Europe and Central Asia",null,null,"High-Income","No data, regional estimates only ",54,null,"Croatia",191,925,0,53,50,45,40,36,34,35,39,44,48,50,49,46,43,39,36,35,35,35,36,36,null,168.399,157.35,150.22,145.37,142.529,137.81800000000001,null,"Croatia",43,0.75700000000000001,0.76800000000000002,0.77400000000000002,0.78,0.78600000000000003,0.79200000000000004,0.79800000000000004,0.80800000000000005,0.81299999999999994,0.81200000000000006,0.81499999999999995,0.82299999999999995,0.82499999999999996,0.83,0.83499999999999996,0.84,0.84099999999999997,0.84499999999999997,0.84799999999999998,0.85099999999999998,null,"Croatia","..","..","..","..","..","..","..","..","..",1.7,2.2999999999999998,1.9,2.2000000000000002,2,1.8,1.3,1.3,1.1000000000000001,0.7,"..","..",null,"Croatia","High Income"]
[55,"Cuba","Cuban Peso                              ","CUP","2021-10-01",24,null,"CUB","Cuba","Cuba 2019","Latin America and Caribbean","Caribbean","Latin America and the Caribbean","Upper-Middle-Income","Full data, Source: MICS",55,"2019","Cuba",192,915,0,163,160,151,140,129,121,117,115,116,118,121,124,128,132,134,133,129,122,113,106,101,null,531.20500000000004,494.60500000000002,470.95400000000001,452.73399999999998,433.28800000000001,412.74599999999998,null,"Cuba",70,0.69099999999999995,0.69599999999999995,0.69799999999999995,0.70799999999999996,0.72199999999999998,0.73399999999999999,0.75600000000000001,0.77200000000000002,0.78300000000000003,0.78500000000000003,0.78100000000000003,0.78,0.76900000000000002,0.76600000000000001,0.76700000000000002,0.77200000000000002,0.77300000000000002,0.77700000000000002,0.78100000000000003,0.78300000000000003,null,"Cuba","..","..","..","..","..","..","..","..","..","..","..","..","..","..","..","..","..","..","..","..","..",null,"Cuba","Upper Middle Income"]
[56,"Curaçao","Antillean Guilder","ANG","2021-10-01",0.55869999999999997,null,"CUW",null,null,null,null,null,"High-Income","No data",56,null,"Curaçao",531,915,0,1,2,2,2,2,2,2,2,2,2,2,2,2,2,2,2,2,2,2,2,2,null,8.8140000000000001,8.9510000000000005,8.9860000000000007,8.8249999999999993,8.56,8.2870000000000008,null,"Curaçao",null,null,null,null,null,null,null,null,null,null,null,null,null,null,null,null,null,null,null,null,null,null,"Curaçao","..","..","..","..","..","..","..","..","..","..","..","..","..","..","..","..","..","..","..","..","..",null,"Curaçao","High Income"]
[57,"Cyprus","Euro                                    ","EUR","2021-10-01",0.86,null,"CYP",null,null,"Western Europe",null,null,"High-Income","No data",57,null,"Cyprus",196,922,0,12,12,12,11,11,11,12,12,12,13,13,13,13,13,13,13,13,13,13,13,12,null,57.752000000000002,54.976999999999997,55.094000000000001,56.212000000000003,56.56,55.728999999999999,null,"Cyprus",33,0.80400000000000005,0.81,0.81899999999999995,0.82799999999999996,0.83099999999999996,0.83599999999999997,0.84199999999999997,0.84899999999999998,0.85799999999999998,0.86199999999999999,0.85599999999999998,0.86,0.85899999999999999,0.86,0.86199999999999999,0.86499999999999999,0.873,0.878,0.88500000000000001,0.88700000000000001,null,"Cyprus","..","..","..","..",0.1,0.1,"..","..","..",0.1,0.1,"..","..",0.2,0.2,0.1,0.1,0.1,0.1,"..","..",null,"Cyprus"]
[58,"Czechia","Czech Koruna                            ","CZK","2021-10-01",21.93,null,"CZE",null,null,"Western Europe",null,null,"High-Income","Partial data: Source: Health records",58,"2005","Czechia",203,923,0,71,74,82,93,103,112,117,121,122,122,120,116,110,104,99,97,99,104,110,115,117,null,520.83600000000001,490.16399999999999,480.01100000000002,496.71499999999997,518.29200000000003,524.75699999999995,null,"Czechia",27,0.80400000000000005,0.81399999999999995,0.82099999999999995,0.83,0.83399999999999996,0.84299999999999997,0.85199999999999998,0.85799999999999998,0.86299999999999999,0.86599999999999999,0.87,0.874,0.874,0.88200000000000001,0.88800000000000001,0.89100000000000001,0.89300000000000002,0.89600000000000002,0.89800000000000002,0.9,null,"Czechia","..","..","..","..","..",0.1,0.1,0.2,0.1,0.1,0.1,0.1,0.3,0.1,0.1,"..",0.1,0.1,"..","..","..",null,"Czechia","High Income"]
[59,"Dem. People's Republic of Korea","Korean Won, North Korea                 ","KPW","2021-10-01",106,null,"PRK",null,null,"Northeast Asia  ",null,null,"Low-Income","No data",59,null,"Dem. People's Republic of Korea",408,906,0,377,373,376,381,384,381,371,355,337,323,315,317,326,338,350,359,362,362,360,356,353,null,1760.143,1701.64,1591.2739999999999,1488.8579999999999,1444.4849999999999,1450.4849999999999,null,"Dem. People's Republic of Korea",null,null,null,null,null,null,null,null,null,null,null,null,null,null,null,null,null,null,null,null,null,null,"Dem. People's Republic of Korea","..","..","..","..","..","..","..","..","..","..","..","..","..","..","..","..","..","..","..","..","..",null,"Dem. People's Republic of Korea","Low income"]
[60,"Democratic Republic of the Congo","Congo Franc, Dem. Rep.of                ","CDF","2021-10-01",1969.2739999999999,null,"COD","Democratic Republic of the Congo","DRC2017_18","West and Central Africa","Middle Africa","Sub-Saharan Africa","Low-Income","Full data, Source: MICS",60,"2017-18","Democratic Republic of the Congo",180,911,0,1906,1960,2027,2104,2185,2268,2343,2419,2498,2577,2658,2734,2811,2888,2963,3034,3097,3157,3216,3276,3339,null,18810.591,20514.035,22209.153999999999,23662.942999999999,24841.648000000001,25717.651999999998,null,"Democratic Republic of the Congo",175,0.34899999999999998,0.35,0.35799999999999998,0.36599999999999999,0.374,0.38100000000000001,0.38900000000000001,0.4,0.41199999999999998,0.41899999999999998,0.435,0.438,0.442,0.44800000000000001,0.46,0.46400000000000002,0.47099999999999997,0.47499999999999998,0.47799999999999998,0.48,null,"Democratic Republic of the Congo","..","..","..","..",98.5,"..","..","..","..","..","..","..",91.4,"..","..","..","..","..","..","..","..",null,"Democratic Republic of the Congo","Low income"]
[61,"Denmark","Danish Krone                            ","DKK","2021-10-01",6.3929999999999998,null,"DNK",null,null,"Western Europe",null,null,"High-Income","Partial data: Source: Health records",61,"2013","Denmark",208,924,0,63,62,63,63,64,65,66,67,67,67,66,63,60,56,53,52,53,57,61,65,68,null,325.91399999999999,336.77300000000002,334.44200000000001,327.072,320.72399999999999,320.86900000000003,null,"Denmark",10,0.87,0.88300000000000001,0.89,0.90100000000000002,0.90500000000000003,0.91,0.91200000000000003,0.91100000000000003,0.91700000000000004,0.91400000000000003,0.91700000000000004,0.93,0.93100000000000005,0.93300000000000005,0.93500000000000005,0.93300000000000005,0.93500000000000005,0.93600000000000005,0.93899999999999995,0.94,null,"Denmark","..","..","..",0.4,0.3,0.3,0.2,0.3,0.4,0.6,0.1,"..","..",0.3,0.2,0.2,0.3,0.2,0.2,"..","..",null,"Denmark","High Income"]
[62,"Djibouti","Djibouti Francs                         ","DJF","2021-10-01",177,null,"DJI","Djibouti","Djibouti 2006","Eastern and Southern Africa","Eastern Africa","Sub-Saharan Africa","Lower-Middle Income","Full data, Source: MICS",62,"2006","Djibouti",262,910,0,22,22,22,22,21,21,20,19,19,18,18,19,19,20,21,22,22,21,20,19,19,null,99.468999999999994,94.882000000000005,90.972999999999999,88.888000000000005,88.587000000000003,88.881,null,"Djibouti",166,0.36,0.36899999999999999,0.375,0.38500000000000001,0.39300000000000002,0.40200000000000002,0.41299999999999998,0.42299999999999999,0.432,0.442,0.45400000000000001,0.46300000000000002,0.47399999999999998,0.48399999999999999,0.49199999999999999,0.499,0.505,0.51,0.51800000000000002,0.52400000000000002,null,"Djibouti","..","..",47.3,"..","..","..","..","..","..","..","..","..",38,44.2,"..","..","..",39.799999999999997,"..","..","..",null,"Djibouti","Lower Middle Income"]
[63,"Dominica","E.C. Dollar                             ","XCD","2021-10-01",2.7,null,"DMA",null,null,"Latin America and Caribbean",null,null,"Upper-Middle-Income","No data, regional estimates only ",63,null,"Dominica",null,null,null,null,null,null,null,null,null,null,null,null,null,null,null,null,null,null,null,null,null,null,null,1.123,null,null,null,null,null,null,null,null,"Dominica",94,0.70299999999999996,0.70699999999999996,0.70699999999999996,0.71199999999999997,0.71399999999999997,0.71499999999999997,0.72099999999999997,0.72499999999999998,0.73,0.73099999999999998,0.74,0.74099999999999999,0.73899999999999999,0.73899999999999999,0.74099999999999999,0.73899999999999999,0.74,0.73599999999999999,0.73799999999999999,0.74199999999999999,null,"Dominica","..","..","..","..","..","..","..","..","..","..","..","..","..","..","..","..","..","..","..","..","..",null,"Dominica"]
[64,"Dominican Republic","Dominican Peso                          ","DOP","2021-10-01",55.975999999999999,null,"DOM","Dominican Republic","Full data, Source: MICS-DomRep 2019","Latin America and Caribbean","Caribbean","Latin America and the Caribbean","Upper-Middle-Income","Full data, Source: MICS",64,"2019","Dominican Republic",214,915,0,198,197,198,198,199,200,200,200,200,200,200,201,202,203,203,204,204,203,203,202,200,null,998.101,950.71699999999998,909.41899999999998,873.67200000000003,839.43399999999997,800.221,null,"Dominican Republic",88,0.65900000000000003,0.66300000000000003,0.66800000000000004,0.66900000000000004,0.67200000000000004,0.68100000000000005,0.68799999999999994,0.69399999999999995,0.69799999999999995,0.7,0.70599999999999996,0.71,0.71399999999999997,0.71799999999999997,0.73,0.73799999999999999,0.74299999999999999,0.746,0.751,0.75600000000000001,null,"Dominican Republic",12.9,12.3,14,17.100000000000001,22.5,16.399999999999999,13.8,13.3,13.7,12.3,12,10.4,11.1,10.1,7.8,6.4,5.9,3.8,2.6,2.7,"..",null,"Dominican Republic","Upper Middle Income"]
[65,"Ecuador","US Dollar                               ","USD","2021-10-01",1,null,"ECU",null,null,"Latin America and Caribbean",null,null,"Upper-Middle-Income","No data, regional estimates only ",65,null,"Ecuador",218,931,0,321,319,316,312,308,306,306,307,310,313,316,319,322,325,327,330,332,334,336,337,336,null,1680.404,1641.498,1608.549,1579.1469999999999,1547.229,1508.9390000000001,null,"Ecuador",86,0.67500000000000004,0.68,0.68400000000000005,0.68700000000000006,0.69299999999999995,0.69799999999999995,0.70099999999999996,0.71,0.71699999999999997,0.71899999999999997,0.72599999999999998,0.73199999999999998,0.751,0.754,0.75600000000000001,0.76400000000000001,0.75800000000000001,0.76,0.76200000000000001,0.75900000000000001,null,"Ecuador",50,"..","..",30.5,31.9,25.3,19.899999999999999,19.399999999999999,18.3,17.3,14.9,12.2,11.5,10.1,8.6,9.4,9.4,8.6999999999999993,9.6999999999999993,9.8000000000000007,"..",null,"Ecuador","Upper Middle Income"]
[66,"Egypt","Egyptian Pound                          ","EGP","2021-10-01",15.664,null,"EGY",null,"Egypt (subnational) 2013-2014","Middle East and North Africa","Western Asia","Western Asia and Northern Africa","Lower-Middle Income","Full data, Source: MICS",66,"2013-14","Egypt",818,912,0,1807,1813,1803,1784,1772,1777,1800,1836,1892,1975,2087,2241,2423,2603,2739,2803,2771,2671,2535,2408,2327,null,12648.393,12633.69,13328.865,14210.745000000001,14610.466,14639.565000000001,null,"Egypt",116,0.61299999999999999,0.61799999999999999,0.622,0.625,0.63100000000000001,0.63700000000000001,0.64500000000000002,0.65300000000000002,0.66,0.66200000000000003,0.66800000000000004,0.67100000000000004,0.67700000000000005,0.68300000000000005,0.68500000000000005,0.69099999999999995,0.69599999999999995,0.69799999999999995,0.70099999999999996,0.70699999999999996,null,"Egypt","..","..","..","..",35.4,"..","..","..",33.5,"..",23.7,"..",19,"..","..",18.2,"..",28.9,"..","..","..",null,"Egypt","Lower Middle Income"]
[67,"El Salvador","US Dollar                               ","USD","2021-10-01",1,null,"SLV","El Salvador","El Salvador 2014","Latin America and Caribbean","Central America","Latin America and the Caribbean","Lower-Middle Income","Full data, Source: MICS",67,"2014","El Salvador",222,916,0,144,139,133,127,122,120,119,121,123,126,127,126,123,120,118,116,115,116,116,117,117,null,562.96600000000001,523.91099999999994,483.3,448.90600000000001,422.15199999999999,398.505,null,"El Salvador",124,0.61499999999999999,0.62,0.627,0.63300000000000001,0.63900000000000001,0.64600000000000002,0.65300000000000002,0.65200000000000002,0.65500000000000003,0.65600000000000003,0.66800000000000004,0.66400000000000003,0.66900000000000004,0.67,0.66800000000000004,0.66800000000000004,0.67100000000000004,0.67100000000000004,0.67,0.67300000000000004,null,"El Salvador",24.3,25.9,26.2,27.2,22.9,23.1,19.2,15.3,19.8,19.399999999999999,18.3,16.7,14.7,12.7,12.4,10.199999999999999,10.7,8.6999999999999993,8,5.7,"..",null,"El Salvador","Lower Middle Income"]
[68,"Equatorial Guinea","CFA Franc                               ","XAF","2021-10-01",563.97299999999996,null,"GNQ",null,null,"West and Central Africa",null,null,"Upper-Middle-Income","Full data, Source: MICS",68,"2000","Equatorial Guinea",226,911,0,22,23,24,25,26,27,28,29,30,31,33,34,35,36,37,37,38,39,40,41,42,null,238.35599999999999,258.06099999999998,272.71800000000002,284.87200000000001,296.286,305.36,null,"Equatorial Guinea",145,0.52500000000000002,0.53400000000000003,0.54600000000000004,0.54700000000000004,0.55400000000000005,0.56499999999999995,0.57599999999999996,0.58199999999999996,0.58299999999999996,0.58499999999999996,0.57599999999999996,0.57999999999999996,0.58399999999999996,0.58499999999999996,0.58599999999999997,0.58899999999999997,0.58799999999999997,0.58399999999999996,0.58199999999999996,0.59199999999999997,null,"Equatorial Guinea","..","..","..","..","..","..","..","..","..","..","..","..","..","..","..","..","..","..","..","..","..",null,"Equatorial Guinea","Upper Middle Income"]
[69,"Eritrea","Eritrea Nakfa                           ","ERN","2021-10-01",15,null,"ERI",null,null,"Eastern and Southern Africa",null,null,"Low-Income","No data, regional estimates only ",69,null,"Eritrea",232,910,0,64,69,76,86,95,102,108,112,115,115,113,109,103,97,92,90,91,94,99,104,107,null,521.18899999999996,546.48400000000004,584.51700000000005,615.58399999999995,628.65899999999999,626.74699999999996,null,"Eritrea",180,"..","..","..","..","..",0.42699999999999999,0.42799999999999999,0.43,0.42599999999999999,0.436,0.436,0.436,0.441,0.44600000000000001,0.45700000000000002,0.45400000000000001,0.45600000000000002,0.45400000000000001,0.45600000000000002,0.45900000000000002,null,"Eritrea","..","..","..","..","..","..","..","..","..","..","..","..","..","..","..","..","..","..","..","..","..",null,"Eritrea","Low income"]
[70,"Estonia","Euro                                    ","EUR","2021-10-01",0.86,null,"EST",null,null,"Western Europe",null,null,"High-Income","No data",70,null,"Estonia",233,924,0,12,13,14,14,15,16,16,16,17,17,16,16,15,13,13,12,12,12,13,13,13,null,65.161000000000001,59.042999999999999,54.906999999999996,54.889000000000003,56.476999999999997,56.259,null,"Estonia",29,0.78700000000000003,0.79700000000000004,0.80500000000000005,0.81299999999999994,0.82099999999999995,0.83199999999999996,0.83899999999999997,0.84599999999999997,0.84799999999999998,0.84599999999999997,0.85199999999999998,0.86,0.86499999999999999,0.86899999999999999,0.871,0.877,0.88100000000000001,0.88500000000000001,0.88900000000000001,0.89200000000000002,null,"Estonia","..","..","..",4.9000000000000004,2.7,1.6,1.3,0.8,0.7,1.1000000000000001,1.6,1.6,1.3,1.5,1.2,0.9,0.7,0.5,0.5,"..","..",null,"Estonia","High Income"]
[71,"Ethiopia","Ethiopian Birr                          ","ETB","2021-10-01",45.981999999999999,null,"ETH","Ethiopia","Full data, Source: Full data, Source: DHS-Ethiopia 2019","Eastern and Southern Africa","Eastern Africa","Sub-Saharan Africa","Low-Income","Full data, Source: DHS",71,"2019","Ethiopia",231,910,0,2708,2739,2755,2761,2766,2777,2792,2814,2845,2886,2939,2997,3067,3142,3214,3278,3329,3371,3408,3442,3477,null,18513.46,19049.721000000001,19345.585999999999,19584.969000000001,19884.879000000001,20024.64,null,"Ethiopia",173,0.29199999999999998,0.30599999999999999,0.315,0.31900000000000001,0.33400000000000002,0.35499999999999998,0.371,0.38600000000000001,0.40300000000000002,0.41099999999999998,0.42099999999999999,0.432,0.438,0.44700000000000001,0.45500000000000002,0.46200000000000002,0.46700000000000003,0.47399999999999998,0.47799999999999998,0.48499999999999999,null,"Ethiopia","..","..","..","..",79.8,"..","..","..","..","..",74.599999999999994,"..","..","..","..",68.900000000000006,"..","..","..","..","..",null,"Ethiopia","Low income"]
[72,"Falkand Island","Falkand Islands Pound","FKP","2021-10-01",1.3611,null,"FLK",null,null,"Latin America and Caribbean",null,null,"High-Income","No data, regional estimates only ",72,null,"Falkand Island",null,null,null,null,null,null,null,null,null,null,null,null,null,null,null,null,null,null,null,null,null,null,null,null,null,null,null,null,null,null,null,null,"Falkand Island",null,null,null,null,null,null,null,null,null,null,null,null,null,null,null,null,null,null,null,null,null,null,"Falkand Island",null,null,null,null,null,null,null,null,null,null,null,null,null,null,null,null,null,null,null,null,null,null,"Falkand Island"]
[73,"Fiji","Fiji Dollar                             ","FJD","2021-10-01",2.09,null,"FJI",null,null,"Oceania",null,null,"Upper-Middle-Income","No data, regional estimates only ",73,null,"Fiji",242,928,0,19,19,19,19,19,19,19,19,19,19,19,19,19,19,18,18,18,18,18,18,18,null,89.757000000000005,87.055999999999997,86.718000000000004,86.308000000000007,84.962999999999994,83.213999999999999,null,"Fiji",93,0.69499999999999995,0.69799999999999995,0.7,0.70199999999999996,0.70899999999999996,0.70499999999999996,0.70799999999999996,0.71099999999999997,0.71199999999999997,0.71499999999999997,0.71499999999999997,0.71899999999999997,0.72199999999999998,0.72799999999999998,0.73299999999999998,0.73699999999999999,0.73799999999999999,0.74,0.74199999999999999,0.74299999999999999,null,"Fiji","..","..",14.2,"..","..","..","..","..",10.9,"..","..","..","..",7.5,"..","..","..","..","..","..","..",null,"Fiji","Upper Middle Income"]
[74,"Finland","Euro                                    ","EUR","2021-10-01",0.86,null,"FIN",null,null,"Western Europe",null,null,"High-Income","Partial data, Source: National survey",74,"2010","Finland",246,924,0,52,51,53,55,57,59,61,62,62,63,63,62,61,60,59,57,55,53,50,49,47,null,238.36099999999999,236.41,241.43799999999999,246.52600000000001,247.80500000000001,241.035,null,"Finland",11,0.86399999999999999,0.871,0.874,0.877,0.90400000000000003,0.90800000000000003,0.91200000000000003,0.91500000000000004,0.91700000000000004,0.91200000000000003,0.91600000000000004,0.92,0.92100000000000004,0.92800000000000005,0.92800000000000005,0.93,0.93200000000000005,0.93500000000000005,0.93700000000000006,0.93799999999999994,null,"Finland","..","..","..",0.1,0.1,0.1,0.1,0.1,0.1,0.1,0.1,0.1,0.1,0.1,0.1,0.1,0.1,0.1,0.1,"..","..",null,"Finland","High Income"]
[75,"France","Euro                                    ","EUR","2021-10-01",0.86,null,"FRA",null,null,"Western Europe",null,null,"High-Income","Partial data, Source: National survey",75,"2012-13","France",250,926,0,765,771,775,778,780,783,787,791,794,796,796,795,793,788,780,768,753,733,714,699,691,null,3583.2249999999999,3535.0790000000002,3542.1439999999998,3571.2559999999999,3549.703,3469.7269999999999,null,"France",26,0.84899999999999998,0.85099999999999998,0.85199999999999998,0.85499999999999998,0.85799999999999998,0.86699999999999999,0.871,0.874,0.875,0.876,0.879,0.88200000000000001,0.88500000000000001,0.88900000000000001,0.89300000000000002,0.89500000000000002,0.89400000000000002,0.89700000000000002,0.89800000000000002,0.90100000000000002,null,"France",0.2,"..","..",0.2,0.1,0.1,"..","..","..",0.1,0.1,0.1,0.1,0.1,"..",0.2,0.1,"..",0.1,"..","..",null,"France","High Income"]
[76,"French Guiana","Euro                                    ","EUR","2021-10-01",0.86,null,"GUF",null,null,null,null,null,"","No data",76,null,"French Guiana",254,931,0,4,5,5,5,5,6,6,6,6,6,6,6,6,6,6,6,7,7,7,8,8,null,37.704999999999998,40.042000000000002,42.48,44.427999999999997,46.040999999999997,48.055,null,"French Guiana",null,null,null,null,null,null,null,null,null,null,null,null,null,null,null,null,null,null,null,null,null,null,"French Guiana","..","..","..","..","..","..","..","..","..","..","..","..","..","..","..","..","..","..","..","..","..",null,"French Guiana"]
[77,"French Polynesia","CFP Franc                               ","XPF","2021-10-01",102.598,null,"PYF",null,null,"Oceania",null,null,"High-Income","No data, regional estimates only ",77,null,"French Polynesia",258,957,0,5,5,5,5,5,5,4,4,4,4,4,4,4,4,3,3,3,4,4,4,5,null,19.352,18.474,17.789000000000001,17.254000000000001,16.594000000000001,15.935,null,"French Polynesia",null,null,null,null,null,null,null,null,null,null,null,null,null,null,null,null,null,null,null,null,null,null,"French Polynesia","..","..","..","..","..","..","..","..","..","..","..","..","..","..","..","..","..","..","..","..","..",null,"French Polynesia"]
[78,"Gabon","CFA Franc                               ","XAF","2021-10-01",563.97299999999996,null,"GAB","Gabon","Full data, Source: Full data, Source: DHS-Gabon 2012","West and Central Africa","Middle Africa","Sub-Saharan Africa","Upper-Middle-Income","Full data, Source: DHS",78,"2012","Gabon",266,911,0,38,38,39,40,41,42,43,45,47,49,51,53,56,58,60,61,63,64,65,66,66,null,333.24900000000002,333.56,342.03500000000003,359.03899999999999,379.80200000000002,396.25400000000002,null,"Gabon",119,0.621,0.624,0.626,0.627,0.626,0.63200000000000001,0.63200000000000001,0.63700000000000001,0.63900000000000001,0.64600000000000002,0.65200000000000002,0.65700000000000003,0.66600000000000004,0.67300000000000004,0.68200000000000005,0.68500000000000005,0.69,0.69399999999999995,0.69699999999999995,0.70299999999999996,null,"Gabon","..","..","..","..","..",25.8,"..","..","..","..","..","..","..","..","..","..","..",11.2,"..","..","..",null,"Gabon","Upper Middle Income"]
[79,"Gambia","Gambian Dalasi                          ","GMD","2021-10-01",51.84,null,"GMB","Gambia","Full data, Source: Full data, Source: DHS-Gambia 2019-2020","West and Central Africa","Western Africa","Sub-Saharan Africa","Low-Income","Full data, Source: DHS",79,"2019-20","Gambia",270,914,0,51,52,54,56,58,60,62,64,65,67,69,71,73,75,77,78,80,82,83,85,86,null,471.40699999999998,502.05599999999998,528.17100000000005,551.92399999999998,571.56899999999996,586.79499999999996,null,"Gambia",172,0.40300000000000002,0.41099999999999998,0.41499999999999998,0.42199999999999999,0.43099999999999999,0.435,0.44,0.44600000000000001,0.45300000000000001,0.45600000000000002,0.45900000000000002,0.45500000000000002,0.46100000000000002,0.46700000000000003,0.46800000000000003,0.47099999999999997,0.47499999999999998,0.48,0.48699999999999999,0.496,null,"Gambia","..","..","..",69.8,"..","..","..","..","..","..",53.5,"..","..","..","..",38.4,"..","..","..","..","..",null,"Gambia","Low income"]
[80,"Georgia","Georgian Lari                           ","GEL","2021-10-01",3.1179999999999999,null,"GEO","Georgia","Georgia 2018","Eastern Europe and Central Asia","Western Asia","Western Asia and Northern Africa","Upper-Middle-Income","Full data, Source: MICS",80,"2018","Georgia",268,922,0,53,51,49,48,48,49,50,52,55,58,59,60,61,60,59,58,56,54,52,50,49,null,241.333,220.536,214.18799999999999,215.352,214.73099999999999,206.33799999999999,null,"Georgia",61,0.69,0.69399999999999995,0.69899999999999995,0.70799999999999996,0.71499999999999997,0.72499999999999998,0.73099999999999998,0.74299999999999999,0.74199999999999999,0.746,0.751,0.75700000000000001,0.76700000000000002,0.77500000000000002,0.78300000000000003,0.79,0.79200000000000004,0.79900000000000004,0.80500000000000005,0.81200000000000006,null,"Georgia",44.2,46.4,29.9,30.1,27.8,30.1,30.1,32.5,28.9,28.9,30.6,28.3,25.4,20.8,17.8,15.7,16.100000000000001,16.100000000000001,15.5,14.9,"..",null,"Georgia","Upper Middle Income"]
[81,"Germany","Euro                                    ","EUR","2021-10-01",0.86,null,"DEU",null,null,"Western Europe",null,null,"High-Income","Partial data, Source: National survey",81,"2009-12","Germany",276,926,0,806,792,764,728,694,669,657,655,659,667,674,678,682,688,699,717,743,776,808,831,838,null,3920.2629999999999,3798.1880000000001,3674.7809999999999,3582.076,3546.808,3591.2759999999998,null,"Germany",6,0.876,0.88400000000000001,0.89,0.89600000000000002,0.90700000000000003,0.90800000000000003,0.91800000000000004,0.92100000000000004,0.92400000000000004,0.92400000000000004,0.92700000000000005,0.93300000000000005,0.93400000000000005,0.93500000000000005,0.93700000000000006,0.93799999999999994,0.94099999999999995,0.94299999999999995,0.94599999999999995,0.94699999999999995,null,"Germany",0.2,"..","..",0.2,0.2,"..","..","..",0.2,"..",0.2,"..","..","..",0.2,"..",0.2,"..","..","..","..",null,"Germany","High Income"]
[82,"Ghana","Ghana Cedi                              ","GHS","2021-10-01",5.9550000000000001,null,"GHA","Ghana","Ghana2017_18","West and Central Africa","Western Africa","Sub-Saharan Africa","Lower-Middle Income","Full data, Source: MICS",82,"2017-18","Ghana",288,914,0,651,657,661,665,670,679,691,706,723,741,759,776,793,808,820,830,835,837,838,839,844,null,4535.3109999999997,4712.0810000000001,4901.0330000000004,5093.54,5274.1580000000004,5415.6660000000002,null,"Ghana",138,0.49399999999999999,0.49299999999999999,0.499,0.5,0.50900000000000001,0.52,0.52900000000000003,0.54100000000000004,0.55300000000000005,0.55800000000000005,0.56499999999999995,0.57399999999999995,0.57699999999999996,0.58599999999999997,0.59,0.59,0.59799999999999998,0.60199999999999998,0.60599999999999998,0.61099999999999999,null,"Ghana","..","..","..","..","..",48,"..","..","..","..","..","..",30.9,"..","..","..",29.3,"..","..","..","..",null,"Ghana","Lower Middle Income"]
[83,"Gibraltar","Gibraltar Pound                         ","GIP","2021-10-01",0.74399999999999999,null,"GIB",null,null,"Western Europe",null,null,"High-Income","No data",83,null,"Gibraltar",null,null,null,null,null,null,null,null,null,null,null,null,null,null,null,null,null,null,null,null,null,null,null,null,null,null,null,null,null,null,null,null,"Gibraltar",null,null,null,null,null,null,null,null,null,null,null,null,null,null,null,null,null,null,null,null,null,null,"Gibraltar",null,null,null,null,null,null,null,null,null,null,null,null,null,null,null,null,null,null,null,null,null,null,"Gibraltar"]
[84,"GLOBAL","US Dollar                               ",null,"2021-10-01",1,null,null,"GLOBAL","GLOBAL","GLOBAL",null,null,"","Global Average",84,null,"GLOBAL",null,null,null,128307.598,129119.497,129050.719,128482.33500000001,128016.28200000001,128101.659,128837.577,130064.697,131553.98300000001,132969.45699999999,134067.31200000001,134726.68,135110.37299999999,135288.351,135385.66200000001,135498.587,135654.14799999999,135825.96299999999,135980.98699999999,136073.533,136077.71299999999,null,null,null,null,null,null,null,null,null,null,null,null,null,null,null,null,null,null,null,null,null,null,null,null,null,null,null,null,null,null,null,null,null,null,null,null,null,null,null,null,null,null,null,null,null,null,null,null,null,null,null,null,null,null,"GLOBAL"]
[85,"Greece","Euro                                    ","EUR","2021-10-01",0.86,null,"GRC",null,null,"Western Europe",null,null,"High-Income","Partial data, Source: National survey",85,"2007-08","Greece",300,925,0,105,104,104,105,107,108,110,113,115,116,114,109,102,94,87,82,80,79,80,81,80,null,356.53399999999999,332.70600000000002,339.66300000000001,351.60500000000002,352.42399999999998,337.18599999999998,null,"Greece",32,0.80400000000000005,0.81399999999999995,0.82599999999999996,0.83299999999999996,0.84299999999999997,0.85299999999999998,0.85899999999999999,0.85699999999999998,0.86499999999999999,0.86699999999999999,0.86499999999999999,0.86199999999999999,0.86499999999999999,0.86699999999999999,0.875,0.877,0.874,0.879,0.88100000000000001,0.88800000000000001,null,"Greece",1,"..","..",0.7,1,0.5,0.9,0.8,0.5,0.7,1.3,2,2.9,2.7,3,2.9,2.1,1.6,0.3,"..","..",null,"Greece","High Income"]
[86,"Greenland","Danish Krone                            ","DKK","2021-10-01",6.3929999999999998,null,"GRD",null,null,"Western Europe",null,null,"High-Income","No data",86,null,"Greenland",null,null,null,null,null,null,null,null,null,null,null,null,null,null,null,null,null,null,null,null,null,null,null,null,null,8.5530000000000008,7.6890000000000001,7.1669999999999998,7.0759999999999996,7.03,6.758,null,"Greenland",null,null,null,null,null,null,null,null,null,null,null,null,null,null,null,null,null,null,null,null,null,null,"Greenland",null,null,null,null,null,null,null,null,null,null,null,null,null,null,null,null,null,null,null,null,null,null,"Greenland"]
[87,"Grenada","E.C. Dollar                             ","XCD","2021-10-01",2.7,null,"GRL",null,null,"Latin America and Caribbean",null,null,"Upper-Middle-Income","No data",87,null,"Grenada",308,915,0,2,2,2,2,2,2,2,2,2,2,2,2,2,2,2,2,2,2,2,2,2,null,null,null,null,null,null,null,null,"Grenada",74,"..","..",0.72099999999999997,0.72899999999999998,0.73099999999999998,0.74399999999999999,0.745,0.75,0.753,0.75,0.754,0.75600000000000001,0.75700000000000001,0.76,0.76600000000000001,0.77,0.77100000000000002,0.77,0.77300000000000002,0.77900000000000003,null,"Grenada","..","..","..","..","..","..","..","..","..","..","..","..","..","..","..","..","..","..","..","..","..",null,"Grenada"]
[88,"Guadeloupe","Euro                                    ","EUR","2021-10-01",0.86,null,"GLP",null,null,null,null,null,"","No data",88,null,"Guadeloupe",312,915,0,6,6,6,6,6,6,5,5,6,5,5,5,5,4,4,4,4,4,5,5,5,null,22.693000000000001,24,24.88,23.59,21.263999999999999,19.791,null,"Guadeloupe",null,null,null,null,null,null,null,null,null,null,null,null,null,null,null,null,null,null,null,null,null,null,"Guadeloupe","..","..","..","..","..","..","..","..","..","..","..","..","..","..","..","..","..","..","..","..","..",null,"Guadeloupe"]
[89,"Guam","US Dollar                               ","USD","2021-10-01",1,null,"GUM",null,null,"Oceania",null,null,"High-Income","No data, regional estimates only ",89,null,"Guam",316,954,0,3,3,3,3,3,3,3,3,3,3,3,3,3,3,3,3,3,3,3,3,3,null,13.837999999999999,13.634,13.186,12.576000000000001,12.03,11.635999999999999,null,"Guam",null,null,null,null,null,null,null,null,null,null,null,null,null,null,null,null,null,null,null,null,null,null,"Guam","..","..","..","..","..","..","..","..","..","..","..","..","..","..","..","..","..","..","..","..","..",null,"Guam"]
[90,"Guatemala","Guatemala Quetzal(es)                   ","GTQ","2021-10-01",7.726,null,"GTM","Guatemala","Full data, Source: Full data, Source: DHS-Guatemala 2014-2015","Latin America and Caribbean","Central America","Latin America and the Caribbean","Upper-Middle-Income","Full data, Source: DHS",90,"2014-2015","Guatemala",null,null,null,null,null,null,null,null,null,null,null,null,null,null,null,null,null,null,null,null,null,null,null,427.6,null,2151.7849999999999,2152.8989999999999,2135.0219999999999,2096.078,2059.3069999999998,2017.924,null,"Guatemala",127,0.54900000000000004,0.55700000000000005,0.56299999999999994,0.56699999999999995,0.57099999999999995,0.57399999999999995,0.58299999999999996,0.59199999999999997,0.59699999999999998,0.60099999999999998,0.60599999999999998,0.61199999999999999,0.61799999999999999,0.621,0.64800000000000002,0.65200000000000002,0.65300000000000002,0.65500000000000003,0.65700000000000003,0.66300000000000003,null,"Guatemala",22.4,"..","..","..","..","..",24.3,"..","..","..","..","..","..","..",24.4,"..","..","..","..","..","..",null,"Guatemala","Upper Middle Income"]
[91,"Guinea","Guinean Franc                           ","GNF","2021-10-01",9701.9,null,"GIN","Guinea","Equatorial Guinea 2000","West and Central Africa","Western Africa","Sub-Saharan Africa","Low-Income","Full data, Source: MICS",91,"2000","Guinea",324,914,0,324,329,334,338,343,348,352,358,363,369,375,379,384,389,394,402,408,417,426,435,443,null,2431.9920000000002,2598.962,2738.471,2859.8020000000001,2971.7640000000001,3081.6590000000001,null,"Guinea",178,0.34,0.34699999999999998,0.35599999999999998,0.34699999999999998,0.372,0.38300000000000001,0.39200000000000002,0.4,0.40799999999999997,0.40799999999999997,0.41599999999999998,0.42899999999999999,0.439,0.44500000000000001,0.45200000000000001,0.45700000000000002,0.46500000000000002,0.47099999999999997,0.47299999999999998,0.47699999999999998,null,"Guinea","..","..",84.5,"..","..","..","..",81.400000000000006,"..","..","..","..",70.900000000000006,"..","..","..","..","..","..","..","..",null,"Guinea","Low income"]
[92,"Guinea-Bissau","CFA Franc                               ","XOF","2021-10-01",563.97299999999996,null,"GNB","Guinea-Bissau","Guinea Bissau 2018-2019","West and Central Africa","Western Africa","Sub-Saharan Africa","Low-Income","Full data, Source: MICS",92,"2018-19","Guinea-Bissau",624,914,0,44,45,45,46,48,49,50,51,53,54,55,56,57,58,59,60,60,61,62,62,63,null,341.46,355.86399999999998,371.714,387.01600000000002,402.48899999999998,413.40899999999999,null,"Guinea-Bissau",175,"..","..","..","..","..",0.40300000000000002,0.41099999999999998,0.41699999999999998,0.42399999999999999,0.43,0.436,0.44500000000000001,0.44800000000000001,0.45200000000000001,0.45900000000000002,0.46400000000000002,0.46800000000000003,0.47,0.47199999999999998,0.48,null,"Guinea-Bissau","..","..",84.5,"..","..","..","..","..","..","..",85.4,"..","..","..","..","..","..","..","..","..","..",null,"Guinea-Bissau","Low income"]
[93,"Guyana","Guyana Dollar                           ","GYD","2021-10-01",208,null,"GUY","Guyana","Full data, Source: MICS-Guyana 2019-2020","Latin America and Caribbean","South America","Latin America and the Caribbean","Upper-Middle-Income","Full data, Source: MICS",93,"2019-20","Guyana",328,931,0,17,17,16,16,16,16,16,15,15,15,15,15,15,16,16,16,16,16,15,15,14,null,74.876000000000005,70.881,67.049000000000007,63.008000000000003,59.539000000000001,56.378999999999998,null,"Guyana",122,0.61599999999999999,0.61899999999999999,0.622,0.61799999999999999,0.625,0.629,0.63,0.63400000000000001,0.63800000000000001,0.64100000000000001,0.64900000000000002,0.65800000000000003,0.66200000000000003,0.66600000000000004,0.67100000000000004,0.67400000000000004,0.67600000000000005,0.67700000000000005,0.68,0.68200000000000005,null,"Guyana","..","..","..","..","..","..","..","..","..","..","..","..","..","..","..","..","..","..","..","..","..",null,"Guyana","Upper Middle Income"]
[94,"Haiti","Haiti Gourde                            ","HTG","2021-10-01",97.61,null,"HTI","Haiti","Full data, Source: Full data, Source: DHS-Haiti 2016-2017","Latin America and Caribbean","Caribbean","Latin America and the Caribbean","Lower-Middle Income","Full data, Source: DHS",94,"2016-17","Haiti",332,915,0,250,251,251,252,253,254,255,256,257,257,258,258,259,259,259,258,258,257,256,255,254,null,1332.078,1298.05,1264.5840000000001,1233.115,1201.539,1166.538,null,"Haiti",170,0.442,0.44400000000000001,0.44600000000000001,0.44900000000000001,0.45,0.45300000000000001,0.45800000000000002,0.46300000000000002,0.46600000000000003,0.47,0.47099999999999997,0.47799999999999998,0.48199999999999998,0.48699999999999999,0.49199999999999999,0.496,0.5,0.505,0.50800000000000001,0.51,null,"Haiti","..","..","..","..","..","..","..","..","..","..","..","..",50.3,"..","..","..","..","..","..","..","..",null,"Haiti","Low income"]
[95,"Honduras","Honduras Lempira                        ","HNL","2021-10-01",23.994,null,"HND","Honduras","Full data, Source: MICS-Honduras 2019","Latin America and Caribbean","Central America","Latin America and the Caribbean","Lower-Middle Income","Full data, Source: MICS",95,"2019","Honduras",340,916,0,222,221,218,213,209,206,205,205,206,207,206,204,202,199,197,197,199,202,206,209,211,null,1046.2380000000001,1032.336,1000.5359999999999,964.73500000000001,929.41600000000005,901.50800000000004,null,"Honduras",132,0.56599999999999995,0.56999999999999995,0.57499999999999996,0.57999999999999996,0.58599999999999997,0.59299999999999997,0.59899999999999998,0.60699999999999998,0.60299999999999998,0.60499999999999998,0.61,0.61299999999999999,0.61199999999999999,0.61299999999999999,0.61599999999999999,0.61799999999999999,0.626,0.63,0.63300000000000001,0.63400000000000001,null,"Honduras","..",36,40.799999999999997,45.6,44.6,42,37.299999999999997,32.6,30.9,27.8,29.9,30,35.700000000000003,31.6,31.8,30.9,30.4,29.3,29.6,29,"..",null,"Honduras","Lower Middle Income"]
[96,"Hungary","Hungary Forint                          ","HUF","2021-10-01",309.61,null,"HUN",null,null,"Western Europe",null,null,"High-Income","No data",96,null,"Hungary",348,923,0,85,86,90,95,100,103,104,103,101,99,96,92,89,85,83,83,85,88,93,97,99,null,444.827,428.13099999999997,409.64699999999999,396.29700000000003,389.13600000000002,384.30700000000002,null,"Hungary",40,0.77200000000000002,0.78100000000000003,0.78800000000000003,0.79700000000000004,0.79900000000000004,0.80500000000000005,0.81499999999999995,0.81799999999999995,0.82199999999999995,0.82799999999999996,0.83099999999999996,0.82799999999999996,0.83099999999999996,0.83899999999999997,0.83799999999999997,0.84199999999999997,0.84399999999999997,0.84599999999999997,0.85,0.85399999999999998,null,"Hungary","..","..","..","..",0.3,1.2,0.3,0.3,0.2,0.1,0.3,0.3,0.6,0.8,1,1.1000000000000001,1.8,1.2,0.5,"..","..",null,"Hungary","High Income"]
[97,"Iceland","Iceland Krona                           ","ISK","2021-10-01",129.47,null,"ISL",null,null,"Western Europe",null,null,"High-Income","No data",97,null,"Iceland",352,924,0,4,4,4,4,4,4,5,5,5,5,5,5,5,5,4,4,4,4,4,4,4,null,19.954999999999998,19.481000000000002,19.210999999999999,19.11,18.895,18.379000000000001,null,"Iceland",4,0.86699999999999999,0.872,0.88100000000000001,0.88700000000000001,0.89100000000000001,0.89600000000000002,0.89900000000000002,0.90500000000000003,0.89900000000000002,0.89800000000000002,0.89800000000000002,0.90700000000000003,0.91500000000000004,0.92700000000000005,0.93100000000000005,0.93400000000000005,0.94099999999999995,0.94299999999999995,0.94599999999999995,0.94899999999999995,null,"Iceland","..","..","..","..",0.2,0.1,0.3,0.1,0.1,0.1,0.2,0.2,0.1,0.1,"..","..",0.1,"..","..","..","..",null,"Iceland","High Income"]
[98,"India","Indian Rupee                            ","INR","2021-10-01",74.150000000000006,null,"IND","India","India 2017","South Asia","Southern Asia","Central Asia and Southern Asia","Lower-Middle Income","Full data, Source: MICS",98,2017,"India",356,5501,0,26286,26336,26339,26307,26259,26205,26169,26142,26068,25877,25526,24966,24256,23523,22942,22635,22694,23019,23485,23905,24143,null,119706.518,117610.423,113920.458,108162.546,102533.21400000001,98476.99,null,"India",131,0.495,0.499,0.50600000000000001,0.51800000000000002,0.52700000000000002,0.53600000000000003,0.54600000000000004,0.55500000000000005,0.56299999999999994,0.56899999999999995,0.57899999999999996,0.58799999999999997,0.59699999999999998,0.60399999999999998,0.61599999999999999,0.624,0.63,0.64,0.64200000000000002,0.64500000000000002,null,"India","..","..","..","..",76.2,"..","..","..","..",71,"..",61.7,"..","..","..","..","..","..","..","..","..",null,"India","Lower Middle Income"]
[99,"Indonesia","Indonesia Rupiah                        ","IDR","2021-10-01",14290,null,"IDN","Indonesia","Full data, Source: Full data, Source: DHS-Indonesia 2017","Southeastern Asia","South-Eastern Asia","Eastern Asia and South-eastern Asia","Lower-Middle Income","Full data, Source: DHS",99,2017,"Indonesia",360,920,0,4211,4219,4251,4298,4346,4384,4415,4433,4453,4496,4574,4705,4868,5030,5142,5174,5098,4943,4750,4576,4466,null,23569.127,23116.749,22719.279999999999,22308.102999999999,21790.268,21157.922999999999,null,"Indonesia",107,0.60299999999999998,0.60899999999999999,0.61499999999999999,0.622,0.628,0.63200000000000001,0.64200000000000002,0.64300000000000002,0.64700000000000002,0.65800000000000003,0.66500000000000004,0.67300000000000004,0.68100000000000005,0.68700000000000006,0.69,0.69499999999999995,0.70299999999999996,0.70699999999999996,0.71199999999999997,0.71799999999999997,null,"Indonesia",77.2,74.599999999999994,61.3,59.8,59.8,57.3,62.4,55.2,53.9,51.1,45,41.9,40.299999999999997,37.6,34.799999999999997,30.5,28.6,24.6,21.5,19.899999999999999,"..",null,"Indonesia","Lower Middle Income"]
[100,"Iran (Islamic Republic of)","Iranian Rial                            ","IRR","2021-10-01",268509,null,"IRN",null,null,"Middle East and North Africa",null,null,"Lower-Middle Income","No data, regional estimates only ",100,null,"Iran (Islamic Republic of)",364,5501,0,1165,1178,1192,1205,1219,1234,1248,1263,1277,1292,1310,1328,1346,1367,1394,1427,1471,1521,1566,1590,1583,null,7060.5479999999998,6375.5029999999997,5996.2280000000001,5984.8440000000001,6140.5129999999999,6262.165,null,"Iran (Islamic Republic of)",70,0.65800000000000003,0.66500000000000004,0.67,0.67700000000000005,0.67800000000000005,0.68300000000000005,0.71899999999999997,0.72299999999999998,0.72799999999999998,0.73399999999999999,0.74199999999999999,0.753,0.76800000000000002,0.77100000000000002,0.77400000000000002,0.77400000000000002,0.78400000000000003,0.78700000000000003,0.78500000000000003,0.78300000000000003,null,"Iran (Islamic Republic of)","..","..","..","..","..",4,4.0999999999999996,"..","..",4.5,"..","..","..",1.7,3.2,3.2,3.1,2.9,3.1,"..","..",null,"Iran (Islamic Republic of)","Upper Middle Income"]
[101,"Iraq","Iraqi Dinar                             ","IQD","2021-10-01",1450,null,"IRQ","Iraq","Iraq 2018","Middle East and North Africa","Western Asia","Western Asia and Northern Africa","Upper-Middle-Income","Full data, Source: MICS",101,"2018","Iraq",368,922,0,818,835,848,858,866,871,880,886,895,913,944,977,1022,1071,1108,1124,1121,1099,1067,1043,1037,null,5865.5619999999999,6182.442,6458.4579999999996,6710.9290000000001,6911.1139999999996,7065.2550000000001,null,"Iraq",123,0.59499999999999997,0.60099999999999998,0.60299999999999998,0.58899999999999997,0.61499999999999999,0.61699999999999999,0.62,0.623,0.63,0.63200000000000001,0.63600000000000001,0.64200000000000002,0.64600000000000002,0.64600000000000002,0.64500000000000002,0.64900000000000002,0.65600000000000003,0.66700000000000004,0.67100000000000004,0.67400000000000004,null,"Iraq","..","..","..","..","..","..",15.7,"..","..","..","..","..",14.8,"..","..","..","..","..","..","..","..",null,"Iraq","Upper Middle Income"]
[102,"Ireland","Euro                                    ","EUR","2021-10-01",0.86,null,"IRL",null,null,"Western Europe",null,null,"High-Income","Partial data: Source: National cohort",102,"2013","Ireland",372,924,0,56,57,58,60,61,64,66,70,73,75,75,75,74,71,69,67,64,62,60,58,57,null,284.76799999999997,269.71800000000002,275.85599999999999,290.84899999999999,300.59899999999999,295.56200000000001,null,"Ireland",2,0.86699999999999999,0.873,0.88100000000000001,0.88900000000000001,0.89800000000000002,0.90400000000000003,0.90600000000000003,0.90900000000000003,0.91100000000000003,0.90600000000000003,0.90100000000000002,0.90200000000000002,0.90800000000000003,0.91700000000000004,0.92800000000000005,0.93500000000000005,0.94299999999999995,0.94699999999999995,0.95099999999999996,0.95499999999999996,null,"Ireland",0.2,"..",0.2,0.2,0.1,0.1,0.5,0.1,0.3,0.6,0.8,0.7,0.5,0.8,0.5,0.4,0.4,0.3,"..","..","..",null,"Ireland","High Income"]
[103,"Israel","Israel Shekel                           ","ILS","2021-10-01",3.2170000000000001,null,"ISR",null,null,"Middle East and North Africa",null,null,"High-Income","No data, regional estimates only ",103,null,"Israel",376,922,0,130,131,131,131,131,132,135,140,145,150,155,160,164,167,170,171,171,170,169,167,166,null,851.84,869.00400000000002,906.06200000000001,951.49800000000005,994.02599999999995,1016.679,null,"Israel",19,0.86099999999999999,0.86499999999999999,0.873,0.874,0.876,0.88,0.88,0.88900000000000001,0.88900000000000001,0.89,0.89500000000000002,0.90100000000000002,0.90300000000000002,0.90500000000000003,0.90900000000000003,0.91,0.91300000000000003,0.91300000000000003,0.91600000000000004,0.91900000000000004,null,"Israel","..",0.5,"..","..","..",1.2,"..",1,"..","..",1,"..",0.9,"..",1,"..",0.7,"..","..","..","..",null,"Israel","High Income"]
[104,"Italy","Euro                                    ","EUR","2021-10-01",0.86,null,"ITA",null,null,"Western Europe",null,null,"High-Income","Partial data, Source: National survey",104,"2013","Italy",380,925,0,514,520,533,549,564,575,582,585,583,578,571,559,545,529,511,494,478,464,450,439,430,null,2116.837,2076.6819999999998,2103.7890000000002,2127.8510000000001,2109.1999999999998,2021.4670000000001,null,"Italy",29,0.83799999999999997,0.84499999999999997,0.85,0.85499999999999998,0.86,0.86499999999999999,0.87,0.874,0.876,0.876,0.879,0.88300000000000001,0.88200000000000001,0.88100000000000001,0.88200000000000001,0.88200000000000001,0.88400000000000001,0.88600000000000001,0.89,0.89200000000000002,null,"Italy",1.7,"..","..",1.1000000000000001,0.9,1,0.9,1.1000000000000001,1,1.3,1.6,1.5,1.8,2,1.7,2.5,2.2000000000000002,1.8,"..","..","..",null,"Italy","High Income"]
[105,"Jamaica","Jamaican Dollar                         ","JMD","2021-10-01",147.34399999999999,null,"JAM","Jamaica","Jamaica 2011","Latin America and Caribbean","Caribbean","Latin America and the Caribbean","Upper-Middle-Income","Full data, Source: MICS",105,"2011","Jamaica",388,915,0,57,55,53,51,49,47,46,46,46,46,47,48,48,49,50,50,49,48,47,45,44,null,225.71299999999999,210.20099999999999,195.36600000000001,182.88,172.90600000000001,164.54,null,"Jamaica",101,0.67800000000000005,0.68899999999999995,0.69199999999999995,0.68700000000000006,0.70399999999999996,0.70599999999999996,0.71099999999999997,0.71899999999999997,0.73699999999999999,0.73299999999999998,0.73199999999999998,0.73099999999999998,0.73099999999999998,0.72899999999999998,0.72899999999999998,0.73099999999999998,0.73099999999999998,0.73399999999999999,0.73399999999999999,0.73399999999999999,null,"Jamaica","..","..",11.3,"..",8.9,"..","..","..","..","..","..","..","..","..","..","..","..","..","..","..","..",null,"Jamaica","Upper Middle Income"]
[106,"Japan","Japanese Yen                            ","JPY","2021-10-01",111.63,null,"JPN",null,null,"Northeast Asia  ",null,null,"High-Income","Partial data, Source: National survey",106,"2009","Japan",392,906,0,1207,1190,1163,1131,1104,1088,1085,1092,1104,1115,1119,1119,1113,1101,1082,1055,1020,977,933,895,869,null,4391.3590000000004,4234.3249999999998,4195.9269999999997,4166.3370000000004,4101.3320000000003,3951.5619999999999,null,"Japan",19,0.85799999999999998,0.86099999999999999,0.86399999999999999,0.86699999999999999,0.871,0.875,0.879,0.88200000000000001,0.88300000000000001,0.88200000000000001,0.88700000000000001,0.89200000000000002,0.89700000000000002,0.90200000000000002,0.90600000000000003,0.90800000000000003,0.91200000000000003,0.91500000000000004,0.91700000000000004,0.91900000000000004,null,"Japan","..","..","..","..","..","..","..","..",0.7,"..",0.2,"..","..",0.9,"..","..","..","..","..","..","..",null,"Japan","High Income"]
[107,"Jordan","Jordanian Dinar                         ","JOD","2021-10-01",0.70799999999999996,null,"JOR","Jordan","Full data, Source: Full data, Source: DHS-Jordan 2017-2018","Middle East and North Africa","Western Asia","Western Asia and Northern Africa","Upper-Middle-Income","Full data, Source: DHS",107,"2017-2018","Jordan",400,922,0,156,157,158,161,165,171,176,183,191,199,208,214,221,226,227,225,223,217,209,202,198,null,1062.117,1016.706,993.18600000000004,972.25,933.88099999999997,884.83,null,"Jordan",102,0.71099999999999997,0.71699999999999997,0.71499999999999997,0.72,0.72599999999999998,0.73799999999999999,0.74099999999999999,0.74399999999999999,0.745,0.74299999999999999,0.73699999999999999,0.73399999999999999,0.73499999999999999,0.72899999999999998,0.72899999999999998,0.73,0.72899999999999998,0.72599999999999998,0.72799999999999998,0.72899999999999998,null,"Jordan","..","..",8.6,"..","..","..",3.9,"..",2.8,"..",2,"..","..","..","..","..","..","..","..","..","..",null,"Jordan","Upper Middle Income"]
[108,"Kazakhstan","Kazakhstan Tenge                        ","KZT","2021-10-01",425.05,null,"KAZ","Kazakhstan","Kazak 2015","Eastern Europe and Central Asia","Central Asia","Central Asia and Southern Asia","Upper-Middle-Income","Full data, Source: MICS",108,"2015","Kazakhstan",398,5500,0,203,211,225,243,263,283,302,321,338,354,367,378,386,391,393,392,388,382,374,365,356,null,1719.2239999999999,1622.954,1684.501,1803.7650000000001,1866.049,1837.44,null,"Kazakhstan",51,0.68500000000000005,0.7,0.71399999999999997,0.72599999999999998,0.73699999999999999,0.747,0.754,0.75800000000000001,0.75800000000000001,0.76200000000000001,0.76400000000000001,0.77200000000000002,0.78200000000000003,0.79100000000000004,0.79800000000000004,0.80600000000000005,0.80800000000000005,0.81499999999999995,0.81899999999999995,0.82499999999999996,null,"Kazakhstan","..",29.8,25.3,20.2,14.3,21.9,4.9000000000000004,2.2999999999999998,1.7,2,1.5,0.6,0.4,0.2,0.2,0.3,0.6,0.3,0.2,"..","..",null,"Kazakhstan","Upper Middle Income"]
[109,"Kenya","Kenyan Shilling                         ","KES","2021-10-01",110.4,null,"KEN","Kenya","Full data, Source: Full data, Source: DHS-Kenya  2014","Eastern and Southern Africa","Eastern Africa","Sub-Saharan Africa","Lower-Middle Income","Full data, Source: DHS",109,"2014","Kenya",404,910,0,1245,1266,1273,1272,1274,1286,1311,1346,1384,1416,1437,1440,1432,1418,1404,1393,1388,1385,1389,1400,1418,null,7779.7749999999996,8195.6270000000004,8500.8760000000002,8598.8690000000006,8619.5460000000003,8627.5339999999997,null,"Kenya",143,0.46100000000000002,0.46500000000000002,0.46500000000000002,0.47799999999999998,0.49,0.5,0.51500000000000001,0.52300000000000002,0.53200000000000003,0.54100000000000004,0.55100000000000005,0.55900000000000005,0.56599999999999995,0.57299999999999995,0.57999999999999996,0.58699999999999997,0.59099999999999997,0.59499999999999997,0.59899999999999998,0.60099999999999998,null,"Kenya","..","..","..","..","..",69.599999999999994,"..","..","..","..","..","..","..","..","..",66.5,"..","..","..","..","..",null,"Kenya","Lower Middle Income"]
[110,"Kiribati","Australian Dollar                       ","AUD","2021-10-01",1.39,null,"KIR","Kiribati","Kiri 2019","Oceania","Oceania","Oceania excluding Australia and New Zealand","Lower-Middle Income","Full data, Source: MICS",110,"2019","Kiribati",296,954,0,2,2,2,2,2,2,2,2,3,3,3,3,3,3,3,3,3,3,3,3,3,null,16.062999999999999,15.82,15.784000000000001,16.366,17.247,17.704999999999998,null,"Kiribati",134,0.55300000000000005,0.56899999999999995,0.56899999999999995,0.57399999999999995,0.57199999999999995,0.58899999999999997,0.58599999999999997,0.58699999999999997,0.59,0.58799999999999997,0.59299999999999997,0.59099999999999997,0.6,0.60799999999999998,0.61699999999999999,0.625,0.622,0.627,0.628,0.63,null,"Kiribati","..","..","..","..","..","..",34.6,"..","..","..","..","..","..","..","..","..","..","..","..","..","..",null,"Kiribati","Lower Middle Income"]
[111,"Kuwait","Kuwaiti Dinar                           ","KWD","2021-10-01",0.30099999999999999,null,"KWT",null,null,"Middle East and North Africa",null,null,"High-Income","No data, regional estimates only ",111,null,"Kuwait",414,922,0,49,49,46,42,40,41,43,48,54,59,63,65,64,63,61,59,59,58,57,56,55,null,249.18700000000001,256.57400000000001,284.36799999999999,309.31599999999997,318.45499999999998,309.76400000000001,null,"Kuwait",64,0.78100000000000003,0.77800000000000002,0.78,0.78800000000000003,0.78900000000000003,0.78300000000000003,0.78800000000000003,0.78800000000000003,0.79,0.78900000000000003,0.78800000000000003,0.79200000000000004,0.79600000000000004,0.79300000000000004,0.79600000000000004,0.80100000000000005,0.80400000000000005,0.80500000000000005,0.80700000000000005,0.80600000000000005,null,"Kuwait","..","..","..","..","..","..","..","..","..","..","..","..","..","..","..","..","..","..","..","..","..",null,"Kuwait","High Income"]
[112,"Kyrgyzstan","Kyrgyzstan Som                          ","KGS","2021-10-01",84.5,null,"KGZ","Kyrgyzstan","Kyrgyz 2018","Eastern Europe and Central Asia","Central Asia","Central Asia and Southern Asia","Lower-Middle Income","Full data, Source: MICS",112,"2018","Kyrgyzstan",417,5500,0,104,102,100,98,98,101,106,113,121,130,139,148,157,164,169,170,166,158,149,140,135,null,731.774,704.20399999999995,725.87699999999995,765.71500000000003,784.57100000000003,775.98400000000004,null,"Kyrgyzstan",120,0.62,0.628,0.63,0.63700000000000001,0.64,0.64200000000000002,0.64700000000000002,0.65400000000000003,0.65600000000000003,0.66100000000000003,0.66200000000000003,0.66400000000000003,0.67400000000000004,0.68,0.68600000000000005,0.69,0.69099999999999995,0.69399999999999995,0.69599999999999995,0.69699999999999995,null,"Kyrgyzstan",72.8,68.599999999999994,67,64.099999999999994,41.2,46.5,34.200000000000003,30.9,20.100000000000001,16,19,16.5,17.100000000000001,21.3,14.9,18.399999999999999,14.1,14.7,10.9,9.6999999999999993,"..",null,"Kyrgyzstan","Lower Middle Income"]
[113,"Lao People's Democratic Republic","Laos Kip                                ","LAK","2021-10-01",9590,null,"LAO","Lao People's Democratic Republic","Lao 2017","Southeastern Asia","South-Eastern Asia","Eastern Asia and South-eastern Asia","Lower-Middle Income","Full data, Source: MICS",113,"2017","Lao People's Democratic Republic",418,920,0,151,149,149,150,152,155,157,161,164,166,167,165,162,159,156,154,155,157,161,163,164,null,806.995,773.29700000000003,741.29200000000003,714.85500000000002,687.14599999999996,654.97699999999998,null,"Lao People's Democratic Republic",137,0.47099999999999997,0.47699999999999998,0.48599999999999999,0.49399999999999999,0.503,0.51200000000000001,0.51400000000000001,0.52700000000000002,0.53500000000000003,0.54500000000000004,0.55200000000000005,0.56499999999999995,0.57499999999999996,0.58199999999999996,0.58899999999999997,0.59799999999999998,0.60499999999999998,0.60799999999999998,0.60899999999999999,0.61299999999999999,null,"Lao People's Democratic Republic","..","..",70.900000000000006,"..","..","..","..",64.099999999999994,"..","..","..","..",46.6,"..","..","..","..","..",37.4,"..","..",null,"Lao People's Democratic Republic","Lower Middle Income"]
[114,"Latvia","Euro                                    ","EUR","2021-10-01",0.86,null,"LVA",null,null,"Western Europe",null,null,"High-Income","No data",114,null,"Latvia",428,924,0,17,19,21,23,24,25,26,25,25,23,22,21,19,18,18,18,20,22,25,27,28,null,90.186999999999998,76.968999999999994,69.72,71.100999999999999,76.015000000000001,78.48,null,"Latvia",37,0.73499999999999999,0.753,0.76700000000000002,0.78100000000000003,0.79500000000000004,0.80900000000000005,0.81599999999999995,0.82499999999999996,0.82799999999999996,0.82599999999999996,0.82399999999999995,0.82899999999999996,0.83199999999999996,0.83899999999999997,0.84499999999999997,0.84899999999999998,0.85399999999999998,0.85899999999999999,0.86299999999999999,0.86599999999999999,null,"Latvia","..","..","..","..",5.4,4.8,2.6,1.6,2.4,3.6,3.6,2.9,2.6,2.4,1.8,1.6,1.4,1.5,0.9,"..","..",null,"Latvia","High Income"]
[115,"Lebanon","Lebanese Pound                          ","LBP","2021-10-01",1507.5,null,"LBN",null,null,"Middle East and North Africa",null,null,"Upper-Middle-Income","No data, regional estimates only ",115,null,"Lebanon",422,922,0,79,78,79,81,82,81,78,73,68,67,72,80,94,110,123,129,132,129,121,113,106,null,544.75099999999998,463.98099999999999,400.416,363.94499999999999,349.85399999999998,347.923,null,"Lebanon",92,"..","..","..","..","..",0.74,0.73899999999999999,0.751,0.75700000000000001,0.76400000000000001,0.76600000000000001,0.76800000000000002,0.75900000000000001,0.75700000000000001,0.748,0.74399999999999999,0.74099999999999999,0.748,0.747,0.74399999999999999,null,"Lebanon","..","..","..","..","..","..","..","..","..","..","..",0.1,"..","..","..","..","..","..","..","..","..",null,"Lebanon","Upper Middle Income"]
[116,"Lesotho","Lesotho Loti                            ","LSL","2021-10-01",15.146000000000001,null,"LSO","Lesotho","Lesotho 2018","Eastern and Southern Africa","Southern Africa","Sub-Saharan Africa","Lower-Middle Income","Full data, Source: MICS",116,"2018","Lesotho",426,913,0,58,58,58,58,58,58,56,55,54,53,52,52,52,52,53,53,54,54,54,54,54,null,271.81299999999999,261.226,255.37899999999999,252.28700000000001,249.09399999999999,243.48699999999999,null,"Lesotho",165,0.45900000000000002,0.45100000000000001,0.44600000000000001,0.44400000000000001,0.44,0.436,0.436,0.441,0.44600000000000001,0.45500000000000002,0.46,0.46899999999999997,0.48,0.48899999999999999,0.498,0.503,0.51200000000000001,0.51700000000000002,0.52200000000000002,0.52700000000000002,null,"Lesotho","..","..",80.400000000000006,"..","..","..","..","..","..","..","..","..","..","..","..","..","..",49.9,"..","..","..",null,"Lesotho","Lower Middle Income"]
[117,"Liberia","Liberian Dollar                         ","LRD","2021-10-01",170.40799999999999,null,"LBR","Liberia","Full data, Source: Full data, Source: DHS-Liberia 2019","West and Central Africa","Western Africa","Sub-Saharan Africa","Low-Income","Full data, Source: DHS",117,"2019","Liberia",430,914,0,109,114,116,116,116,118,120,123,127,131,134,137,139,140,142,144,145,147,149,152,154,null,849.58799999999997,905.65200000000004,955.19100000000003,998.30600000000004,1035.925,1066.7139999999999,null,"Liberia",175,0.435,0.435,0.437,0.41699999999999998,0.42699999999999999,0.432,0.438,0.44500000000000001,0.45,0.45200000000000001,0.45500000000000002,0.47199999999999998,0.46899999999999997,0.47699999999999998,0.47799999999999998,0.47699999999999998,0.47799999999999998,0.48099999999999998,0.48,0.48,null,"Liberia","..","..","..","..","..","..","..",91.3,"..","..","..","..","..","..",76.400000000000006,"..",75.599999999999994,"..","..","..","..",null,"Liberia","Low income"]
[118,"Libya","Libyan Dinar                            ","LYD","2021-10-01",4.5339999999999998,null,"LBY",null,null,"Middle East and North Africa",null,null,"Upper-Middle-Income","No data, regional estimates only ",118,null,"Libya",434,912,0,115,115,116,116,117,119,122,127,131,135,137,138,138,137,135,132,129,125,122,119,116,null,590.94500000000005,554.97400000000005,535.63400000000001,536.84699999999998,541.26800000000003,534.351,null,"Libya",105,0.78,0.78500000000000003,0.79,0.79700000000000004,0.79800000000000004,0.8,0.8,0.8,0.8,0.79900000000000004,0.79800000000000004,0.76400000000000001,0.78900000000000003,0.76100000000000001,0.72799999999999998,0.69699999999999995,0.68700000000000006,0.71399999999999997,0.72099999999999997,0.72399999999999998,null,"Libya","..","..","..","..","..","..","..","..","..","..","..","..","..","..","..","..","..","..","..","..","..",null,"Libya","Upper Middle Income"]
[119,"Liechtenstein","Swiss Franc                             ","CHF","2021-10-01",0.93100000000000005,null,"LIE",null,null,"Western Europe",null,null,"High-Income","No data",119,null,"Liechtenstein",null,null,null,null,null,null,null,null,null,null,null,null,null,null,null,null,null,null,null,null,null,null,null,null,null,null,null,null,null,null,null,null,"Liechtenstein",19,0.86199999999999999,0.86799999999999999,0.873,0.878,0.88300000000000001,0.88600000000000001,0.89,0.89300000000000002,0.89900000000000002,0.89900000000000002,0.90400000000000003,0.90900000000000003,0.90800000000000003,0.91200000000000003,0.91100000000000003,0.91100000000000003,0.91500000000000004,0.91600000000000004,0.91900000000000004,0.91900000000000004,null,"Liechtenstein","..","..","..","..","..","..","..","..","..","..","..","..","..","..","..","..","..","..","..","..","..",null,"Liechtenstein"]
[120,"Lithuania","Euro                                    ","EUR","2021-10-01",0.86,null,"LTU",null,null,"Western Europe",null,null,"High-Income","No data",120,null,"Lithuania",440,924,0,31,31,30,30,30,30,31,31,32,32,33,33,33,33,32,31,30,28,26,24,23,null,130.66800000000001,113.548,98.733999999999995,95.822000000000003,104.03400000000001,110.38200000000001,null,"Lithuania",34,0.76200000000000001,0.77400000000000002,0.78500000000000003,0.79700000000000004,0.80500000000000005,0.81699999999999995,0.82599999999999996,0.83299999999999996,0.83799999999999997,0.82799999999999996,0.83099999999999996,0.83799999999999997,0.84099999999999997,0.84699999999999998,0.85899999999999999,0.86199999999999999,0.86699999999999999,0.873,0.876,0.88200000000000001,null,"Lithuania","..","..","..","..",7,4.3,2.8,1.9,2.2999999999999998,4.3,3.1,1.5,2,2,2.7,1.4,2.2000000000000002,1.5,1.3,"..","..",null,"Lithuania","High Income"]
[121,"Luxembourg","Euro                                    ","EUR","2021-10-01",0.86,null,"LUX",null,null,"Western Europe",null,null,"High-Income","No data",121,null,"Luxembourg",442,926,0,5,5,5,5,5,5,5,5,5,6,6,6,6,6,6,7,7,7,7,7,7,null,32.927,33.311999999999998,33.832999999999998,34.521000000000001,35.674999999999997,37.118000000000002,null,"Luxembourg",23,0.86,0.86499999999999999,0.86899999999999999,0.873,0.876,0.88,0.88400000000000001,0.88800000000000001,0.89,0.89300000000000002,0.89800000000000002,0.89900000000000002,0.9,0.9,0.90300000000000002,0.90600000000000003,0.91,0.91300000000000003,0.91300000000000003,0.91600000000000004,null,"Luxembourg","..","..","..",0.1,"..",0.1,"..","..","..",0.1,"..",0.1,0.1,0.1,0.2,0.3,0.1,0.4,0.4,"..","..",null,"Luxembourg","High Income"]
[122,"Madagascar","Malagasy Ariary, Madagascar             ","MGA","2021-10-01",3931.8,null,"MDG","Madagascar","Madagascar 2018","Eastern and Southern Africa","Eastern Africa","Sub-Saharan Africa","Low-Income","Full data, Source: MICS",122,"2018","Madagascar",450,910,0,613,621,627,632,638,647,658,672,686,701,714,725,735,744,756,770,787,808,829,850,869,null,4650.8140000000003,4992.18,5275.8559999999998,5564.9489999999996,5857.0870000000004,6156.7139999999999,null,"Madagascar",164,0.46200000000000002,0.46800000000000003,0.46400000000000002,0.47299999999999998,0.48,0.48599999999999999,0.49,0.498,0.50600000000000001,0.51,0.51100000000000001,0.51200000000000001,0.51400000000000001,0.51700000000000002,0.52,0.52200000000000002,0.52300000000000002,0.52600000000000002,0.52700000000000002,0.52800000000000002,null,"Madagascar","..",84.6,"..","..","..",89.2,"..","..","..","..",91.2,"..",91.5,"..","..","..","..","..","..","..","..",null,"Madagascar","Low income"]
[123,"Malawi","Malawi Kwacha                           ","MWK","2021-10-01",815,null,"MWI","Malawi","Full data, Source: Full data, Source: DHS-Malawi 2015-2016","Eastern and Southern Africa","Eastern Africa","Sub-Saharan Africa","Low-Income","Full data, Source: DHS",123,"2015-16","Malawi",454,910,0,440,452,461,470,480,493,508,525,542,556,566,567,563,558,554,554,558,567,578,592,607,null,3369.433,3648.5010000000002,3856.857,4024.2939999999999,4181.5450000000001,4319.0749999999998,null,"Malawi",174,0.38800000000000001,0.38800000000000001,0.35699999999999998,0.36099999999999999,0.36299999999999999,0.36699999999999999,0.377,0.38800000000000001,0.40500000000000003,0.42,0.43099999999999999,0.44,0.44600000000000001,0.45600000000000002,0.46500000000000002,0.46800000000000003,0.47199999999999998,0.47299999999999998,0.47799999999999998,0.48299999999999998,null,"Malawi","..","..","..","..",90.2,"..","..","..","..","..",88.6,"..","..","..","..","..",89,"..","..","..","..",null,"Malawi","Low income"]
[124,"Malaysia","Malaysia Ringgit                        ","MYR","2021-10-01",4.1829999999999998,null,"MYS",null,null,"Southeastern Asia",null,null,"Upper-Middle-Income","No data, regional estimates only ",124,null,"Malaysia",458,920,0,544,533,517,499,482,469,463,460,461,466,472,482,495,508,519,528,534,536,536,535,533,null,2647.3879999999999,2556.6950000000002,2417.4029999999998,2287.3490000000002,2225.2660000000001,2219.415,null,"Malaysia",62,0.72299999999999998,0.72099999999999997,0.72299999999999998,0.73,0.73299999999999998,0.73,0.73699999999999999,0.75,0.76100000000000001,0.76500000000000001,0.77200000000000002,0.77800000000000002,0.78100000000000003,0.78500000000000003,0.79100000000000004,0.79600000000000004,0.8,0.80500000000000005,0.80500000000000005,0.81,null,"Malaysia","..","..","..",6.9,"..","..",3.8,"..",4.3,"..","..",1.2,"..",0.4,"..",0.3,"..","..","..","..","..",null,"Malaysia","Upper Middle Income"]
[125,"Maldives","Maldives Rufiyaa                        ","MVR","2021-10-01",15,null,"MDV","Maldives","Full data, Source: Full data, Source: DHS-Maldives 2016-2017","South Asia","Southern Asia","Central Asia and Southern Asia","Upper-Middle-Income","Full data, Source: DHS",125,"2016-17","Maldives",462,5501,0,6,5,5,5,6,6,6,7,7,8,8,8,8,7,7,7,7,7,7,7,7,null,32.116,27.803999999999998,26.273,27.283999999999999,28.382999999999999,27.651,null,"Maldives",95,0.622,0.626,0.63,0.64400000000000002,0.64900000000000002,0.64500000000000002,0.65900000000000003,0.66400000000000003,0.67300000000000004,0.67400000000000004,0.68500000000000005,0.69699999999999995,0.70399999999999996,0.70899999999999996,0.71799999999999997,0.72399999999999998,0.72799999999999998,0.73099999999999998,0.73399999999999999,0.74,null,"Maldives","..","..",19.600000000000001,"..","..","..","..","..","..",16.600000000000001,"..","..","..","..","..","..",0.2,"..","..","..","..",null,"Maldives","Upper Middle Income"]
[126,"Mali","CFA Franc                               ","XOF","2021-10-01",563.97299999999996,null,"MLI","Mali","Full data, Source: Full data, Source: DHS-Mali 2018","West and Central Africa","Western Africa","Sub-Saharan Africa","Low-Income","Full data, Source: DHS",126,"2018","Mali",466,914,0,460,475,492,512,532,553,572,591,609,626,640,651,659,667,675,686,698,713,730,748,765,null,4309.0990000000002,4720.3379999999997,5092.393,5417.9449999999997,5660.5209999999997,5869.5420000000004,null,"Mali",184,0.312,0.32500000000000001,0.33400000000000002,0.34699999999999998,0.35599999999999998,0.36699999999999999,0.376,0.371,0.39400000000000002,0.40100000000000002,0.40799999999999997,0.41299999999999998,0.41299999999999998,0.41299999999999998,0.41899999999999998,0.41699999999999998,0.42199999999999999,0.42699999999999999,0.43099999999999999,0.434,null,"Mali","..",80.900000000000006,"..","..","..","..",78.099999999999994,"..","..",79.8,"..","..","..","..","..","..","..","..","..","..","..",null,"Mali","Low income"]
[127,"Malta","Euro                                    ","EUR","2021-10-01",0.86,null,"MLT",null,null,"Western Europe",null,null,"High-Income","No data",127,null,"Malta",470,925,0,5,4,4,4,4,4,4,4,4,4,4,4,4,4,4,4,4,4,4,4,4,null,21.562999999999999,20.577999999999999,19.103000000000002,18.058,17.876999999999999,18.196999999999999,null,"Malta",28,0.79500000000000004,0.80100000000000005,0.80400000000000005,0.81,0.81899999999999995,0.83399999999999996,0.83199999999999996,0.83699999999999997,0.83899999999999997,0.84,0.85299999999999998,0.85299999999999998,0.86,0.86699999999999999,0.874,0.88,0.88500000000000001,0.88800000000000001,0.89400000000000002,0.89500000000000002,null,"Malta","..","..","..","..","..","..",0.6,0.6,0.2,0.5,0.3,0.4,0.3,"..","..",0.1,0.2,0.2,0.2,"..","..",null,"Malta","High Income"]
[128,"Marshall Islands","US Dollar                               ","USD","2021-10-01",1,null,"MHL",null,null,"Oceania",null,null,"Upper-Middle-Income","No data, regional estimates only ",128,null,"Marshall Islands",null,null,null,null,null,null,null,null,null,null,null,null,null,null,null,null,null,null,null,null,null,null,null,1.7170000000000001,null,null,null,null,null,null,null,null,"Marshall Islands",null,null,null,null,null,null,null,null,null,null,null,null,null,null,null,null,null,null,null,null,null,null,"Marshall Islands",null,null,null,null,null,null,null,null,null,null,null,null,null,null,null,null,null,null,null,null,null,null,"Marshall Islands"]
[129,"Martinique","Euro                                    ","EUR","2021-10-01",0.86,null,"MTQ",null,null,null,null,null,"","No data",129,null,"Martinique",474,915,0,6,6,5,5,5,5,5,5,5,4,4,4,4,3,3,3,3,3,4,4,4,null,17.882000000000001,18.616,19.114000000000001,18.003,15.983000000000001,14.629,null,"Martinique",117,"..","..","..","..","..","..","..","..","..","..","..","..","..","..","..","..","..",0.69899999999999995,0.70199999999999996,0.70399999999999996,null,"Martinique","..","..","..","..","..","..","..","..","..","..","..","..","..","..","..","..","..","..","..","..","..",null,"Martinique"]
[130,"Mauritania","Mauritania Ouguiya                      ","MRU","2021-10-01",36.04,null,"MRT","Mauritania","Mauritania 2011","West and Central Africa","Western Africa","Sub-Saharan Africa","Lower-Middle Income","Full data, Source: MICS",130,"2011","Mauritania",478,914,0,93,95,97,99,102,104,106,109,112,115,118,121,125,128,131,134,136,138,139,141,143,null,791.67499999999995,846.99900000000002,903.65499999999997,964.447,1023.494,1079.7339999999999,null,"Mauritania",157,0.46400000000000002,0.46300000000000002,0.46700000000000003,0.47199999999999998,0.48199999999999998,0.48599999999999999,0.496,0.495,0.49399999999999999,0.502,0.505,0.50900000000000001,0.51700000000000002,0.52500000000000002,0.53100000000000003,0.53600000000000003,0.54200000000000004,0.54,0.54200000000000004,0.54600000000000004,null,"Mauritania",47.1,"..","..","..",47,"..","..","..",34.6,"..","..","..","..","..",24.1,"..","..","..","..","..","..",null,"Mauritania","Lower Middle Income"]
[131,"Mauritius","Mauritius Rupee                         ","MUR","2021-10-01",41.924999999999997,null,"MUS",null,null,"Eastern and Southern Africa",null,null,"Upper-Middle-Income","No data, regional estimates only ",131,null,"Mauritius",480,910,0,17,17,18,19,20,20,19,18,17,15,14,13,13,13,13,14,13,13,13,13,13,null,62.95,61.250999999999998,59.356000000000002,55.78,51.634,48.569000000000003,null,"Mauritius",66,0.67800000000000005,0.68700000000000006,0.69199999999999995,0.70099999999999996,0.70799999999999996,0.71699999999999997,0.72399999999999998,0.73099999999999998,0.73799999999999999,0.745,0.751,0.76,0.77100000000000002,0.77900000000000003,0.78900000000000003,0.78900000000000003,0.79400000000000004,0.79700000000000004,0.80100000000000005,0.80400000000000005,null,"Mauritius","..","..","..","..","..","..",3.6,"..","..","..","..","..",3.2,"..","..","..","..",2.2000000000000002,"..","..","..",null,"Mauritius","Upper Middle Income"]
[132,"Mayotte",null,null,null,null,null,"MYT",null,null,null,null,null,"","No data",132,null,"Mayotte",175,910,0,6,6,6,6,6,6,6,7,7,7,7,7,7,7,7,7,7,7,7,7,7,null,38.146000000000001,40.636000000000003,42.969000000000001,44.518999999999998,45.203000000000003,45.238999999999997,null,"Mayotte",null,null,null,null,null,null,null,null,null,null,null,null,null,null,null,null,null,null,null,null,null,null,"Mayotte","..","..","..","..","..","..","..","..","..","..","..","..","..","..","..","..","..","..","..","..","..",null,"Mayotte"]
[133,"Mexico","Mexican Peso                            ","MXN","2021-10-01",20.440000000000001,null,"MEX","Mexico","Mex2015","Latin America and Caribbean","Central America","Latin America and the Caribbean","Upper-Middle-Income","Full data, Source: MICS",133,"2015","Mexico",484,916,0,2276,2285,2297,2309,2316,2316,2298,2272,2244,2222,2211,2219,2237,2260,2277,2279,2264,2236,2201,2167,2141,null,10785.968999999999,10375.123,9966.5429999999997,9594.1010000000006,9254.5490000000009,8934.6409999999996,null,"Mexico",74,0.70799999999999996,0.71199999999999997,0.71799999999999997,0.72199999999999998,0.73099999999999998,0.73699999999999999,0.745,0.746,0.748,0.748,0.748,0.755,0.75900000000000001,0.75600000000000001,0.76100000000000001,0.76600000000000001,0.76800000000000002,0.77100000000000002,0.77600000000000002,0.77900000000000003,null,"Mexico",21,"..",18.8,"..",15.8,16,13,"..",14.4,"..",12.6,"..",12.1,"..",11.8,"..",7.8,"..",6.5,"..","..",null,"Mexico","Upper Middle Income"]
[134,"Micronesia (Fed. States of)","US Dollar                               ","USD","2021-10-01",1,null,"FSM",null,null,"Oceania",null,null,"Lower-Middle Income","No data, regional estimates only ",134,null,"Micronesia (Fed. States of)",583,954,0,3,3,3,3,3,3,3,3,3,3,3,2,2,2,2,2,2,2,2,3,3,null,13.176,13.175000000000001,12.602,11.801,11.256,10.98,null,"Micronesia (Fed. States of)",136,0.54600000000000004,0.55300000000000005,0.55900000000000005,0.56499999999999995,0.56999999999999995,0.57699999999999996,0.58299999999999996,0.58899999999999997,0.59299999999999997,0.59599999999999997,0.60099999999999998,0.60399999999999998,0.60499999999999998,0.60499999999999998,0.60399999999999998,0.61199999999999999,0.61399999999999999,0.61599999999999999,0.61799999999999999,0.62,null,"Micronesia (Fed. States of)","..","..","..","..","..",24.6,"..","..","..","..","..","..","..",38.700000000000003,"..","..","..","..","..","..","..",null,"Micronesia (Fed. States of)"]
[135,"Monaco","Euro                                    ","EUR","2021-10-01",0.86,null,"MCO",null,null,"Western Europe",null,null,"High-Income","No data",135,null,"Monaco",null,null,null,null,null,null,null,null,null,null,null,null,null,null,null,null,null,null,null,null,null,null,null,null,null,null,null,null,null,null,null,null,"Monaco",null,null,null,null,null,null,null,null,null,null,null,null,null,null,null,null,null,null,null,null,null,null,"Monaco","..","..","..","..","..","..","..","..","..","..","..","..","..","..","..","..","..","..","..","..","..",null,"Monaco"]
[136,"Mongolia","Mongolia Tugrik                         ","MNT","2021-10-01",2835.41,null,"MNG","Mongolia","Mongol  2018","Northeast Asia  ","Eastern Asia","Eastern Asia and South-eastern Asia","Lower-Middle Income","Full data, Source: MICS",136,"2018","Mongolia",496,906,0,46,46,45,45,45,47,49,53,58,63,67,70,74,76,78,78,78,76,74,72,70,null,348.83100000000002,327.23599999999999,327.33,340.79300000000001,355.54899999999998,363.65199999999999,null,"Mongolia",99,0.58799999999999997,0.59899999999999998,0.60799999999999998,0.621,0.63600000000000001,0.64900000000000002,0.65900000000000003,0.67100000000000004,0.68200000000000005,0.68700000000000006,0.69599999999999995,0.71,0.71799999999999997,0.72699999999999998,0.73199999999999998,0.73499999999999999,0.72899999999999998,0.72799999999999998,0.73499999999999999,0.73699999999999999,null,"Mongolia","..","..",33.200000000000003,"..","..","..","..",11.4,"..","..",9.6,6.6,4.0999999999999996,"..",3,"..",6.2,"..",5,"..","..",null,"Mongolia","Lower Middle Income"]
[137,"Montenegro","Euro                                    ","EUR","2021-10-01",0.86,null,"MNE","Montenegro","Monte 2018","Eastern Europe and Central Asia","Southern Europe","Northern America and Europe","Upper-Middle-Income","Full data, Source: MICS",137,"2018","Montenegro",499,925,0,8,8,8,8,8,8,8,8,8,8,8,8,8,7,7,7,7,7,7,8,8,null,35.472000000000001,33.82,32.320999999999998,31.093,30.128,29.32,null,"Montenegro",48,"..","..","..","..","..","..",0.77300000000000002,0.78400000000000003,0.79400000000000004,0.79700000000000004,0.80200000000000005,0.80600000000000005,0.80700000000000005,0.81100000000000005,0.81299999999999994,0.81599999999999995,0.81799999999999995,0.82199999999999995,0.82599999999999996,0.82899999999999996,null,"Montenegro","..","..","..","..","..","..","..","..","..","..","..","..",10.5,8.3000000000000007,8.6,8,6,"..","..","..","..",null,"Montenegro"]
[138,"Montserrat","E.C. Dollar                             ","XCD","2021-10-01",2.7,null,"MSR",null,null,"Latin America and Caribbean",null,null,"","No data",138,null,"Montserrat",null,null,null,null,null,null,null,null,null,null,null,null,null,null,null,null,null,null,null,null,null,null,null,null,null,null,null,null,null,null,null,null,"Montserrat",null,null,null,null,null,null,null,null,null,null,null,null,null,null,null,null,null,null,null,null,null,null,"Montserrat",null,null,null,null,null,null,null,null,null,null,null,null,null,null,null,null,null,null,null,null,null,null,"Montserrat"]
[139,"Morocco","Morocco Dirham                          ","MAD","2021-10-01",9.032,null,"MAR","Morocco","Full data, Source: Full data, Source: DHS-Morocco 2003-2004","Middle East and North Africa","Northern Africa","Western Asia and Northern Africa","Lower-Middle Income","Full data, Source: DHS",139,"2003-4","Morocco",504,912,0,585,588,601,621,639,652,655,651,646,644,650,664,686,708,724,728,715,691,662,636,619,null,3271.88,3143.3809999999999,3053.3739999999998,3006.5459999999998,2967.4119999999998,2897.8820000000001,null,"Morocco",121,0.52900000000000003,0.54100000000000004,0.55100000000000005,0.56200000000000006,0.57199999999999995,0.57999999999999996,0.58599999999999997,0.59399999999999997,0.60199999999999998,0.60799999999999998,0.61599999999999999,0.626,0.63500000000000001,0.64400000000000002,0.65200000000000002,0.65800000000000003,0.66700000000000004,0.67300000000000004,0.68,0.68600000000000005,null,"Morocco",26.7,"..","..","..","..","..",16.2,"..","..","..","..","..","..",7.3,"..","..","..","..","..","..","..",null,"Morocco","Lower Middle Income"]
[140,"Mozambique","Mozambique Metical                      ","MZN","2021-10-01",63.2,null,"MOZ","Mozambique","Full data, Source: Full data, Source: DHS-Mozambique 2011","Eastern and Southern Africa","Eastern Africa","Sub-Saharan Africa","Low-Income","Full data, Source: DHS",140,"2011","Mozambique",508,910,0,696,718,744,769,793,813,828,839,849,860,873,890,910,932,955,978,999,1020,1042,1064,1086,null,6033.8810000000003,6536.6959999999999,6983.549,7393.9210000000003,7746.4539999999997,8061.268,null,"Mozambique",181,0.307,0.32,0.32700000000000001,0.34,0.34899999999999998,0.36,0.36599999999999999,0.378,0.38700000000000001,0.39400000000000002,0.40100000000000002,0.39700000000000002,0.40300000000000002,0.41699999999999998,0.42499999999999999,0.433,0.441,0.44600000000000001,0.45200000000000001,0.45600000000000002,null,"Mozambique","..","..",92.2,"..","..","..","..","..",88.9,"..","..","..","..","..",82.4,"..","..","..","..","..","..",null,"Mozambique","Low income"]
[141,"Myanmar","Myanmar Kyat                            ","MMK","2021-10-01",1815,null,"MMR","Myanmar","Full data, Source: Full data, Source: DHS-Myanmar 2015-2016","Southeastern Asia","South-Eastern Asia","Eastern Asia and South-eastern Asia","Lower-Middle Income","Full data, Source: DHS",141,"2015-2016","Myanmar",104,920,0,1101,1108,1111,1107,1096,1078,1052,1020,985,955,931,915,906,903,905,907,912,919,926,930,932,null,4658.915,4598.2910000000002,4477.1949999999997,4276.3220000000001,4078.973,3913.2150000000001,null,"Myanmar",147,0.41399999999999998,0.42299999999999999,0.432,0.442,0.45200000000000001,0.46100000000000002,0.47099999999999997,0.48199999999999998,0.49299999999999999,0.504,0.51500000000000001,0.52600000000000002,0.53300000000000003,0.54300000000000004,0.55000000000000004,0.55700000000000005,0.56299999999999994,0.57199999999999995,0.57899999999999996,0.58299999999999996,null,"Myanmar","..","..","..","..","..","..","..","..","..","..","..","..","..","..","..",24.6,"..",15,"..","..","..",null,"Myanmar","Lower Middle Income"]
[142,"Namibia","Namibia Dollar                          ","NAD","2021-10-01",15.146000000000001,null,"NAM","Namibia","Full data, Source: Full data, Source: DHS-Namibia 2013","Eastern and Southern Africa","Southern Africa","Sub-Saharan Africa","Upper-Middle-Income","Full data, Source: DHS",142,"2013","Namibia",516,913,0,53,52,51,50,50,51,53,56,59,62,65,66,67,67,67,67,67,67,67,67,67,null,351.04899999999998,352.642,359.71899999999999,368.95699999999999,377.42899999999997,382.19499999999999,null,"Namibia",130,0.54400000000000004,0.54300000000000004,0.54100000000000004,0.54300000000000004,0.54500000000000004,0.54500000000000004,0.55100000000000005,0.55900000000000005,0.56699999999999995,0.57599999999999996,0.58899999999999997,0.60199999999999998,0.61299999999999999,0.624,0.63100000000000001,0.63800000000000001,0.63900000000000001,0.64400000000000002,0.64500000000000002,0.64600000000000002,null,"Namibia","..","..","..",57.1,"..","..","..","..","..",48,"..","..","..","..","..",30.3,"..","..","..","..","..",null,"Namibia","Upper Middle Income"]
[143,"Nauru","Australian Dollar                       ","AUD","2021-10-01",1.39,null,"NRU",null,null,"Oceania",null,null,"High-Income","No data, regional estimates only ",143,null,"Nauru",null,null,null,null,null,null,null,null,null,null,null,null,null,null,null,null,null,null,null,null,null,null,null,0.3,null,null,null,null,null,null,null,null,"Nauru",null,null,null,null,null,null,null,null,null,null,null,null,null,null,null,null,null,null,null,null,null,null,"Nauru","..","..","..","..","..","..","..","..","..","..","..","..",13.2,"..","..","..","..","..","..","..","..",null,"Nauru"]
[144,"Nepal","Nepalese Rupee                          ","NPR","2021-10-01",118.4014,null,"NPL","Nepal","Full data, Source: Full data, Source: DHS-Nepal 2019","South Asia","Southern Asia","Central Asia and Southern Asia","Lower-Middle Income","Full data, Source: DHS",144,2019,"Nepal",524,5501,0,735,718,693,665,638,618,607,603,603,602,598,594,587,578,571,568,557,550,545,544,545,null,2797.6849999999999,2578.2310000000002,2308.384,2068.998,1913.4010000000001,1804.6469999999999,null,"Nepal",142,0.45300000000000001,0.45400000000000001,0.46400000000000002,0.47,0.47599999999999998,0.48199999999999998,0.49299999999999999,0.498,0.50900000000000001,0.52200000000000002,0.53700000000000003,0.54500000000000004,0.55900000000000005,0.56799999999999995,0.57599999999999996,0.58299999999999996,0.58599999999999997,0.58799999999999997,0.59599999999999997,0.60199999999999998,null,"Nepal","..","..","..",77.900000000000006,"..","..","..","..","..","..",50.8,"..","..","..","..","..","..","..","..","..","..",null,"Nepal","Low income"]
[145,"Netherlands","Euro                                    ","EUR","2021-10-01",0.86,null,"NLD",null,null,"Western Europe",null,null,"High-Income","Partial data, Source: National survey",145,"2006-08","Netherlands",528,926,0,189,192,197,203,206,206,202,194,184,176,171,170,172,175,178,180,179,176,172,170,169,null,877.01599999999996,879.06200000000001,866.23900000000003,841.64700000000005,813.81299999999999,795.83500000000004,null,"Netherlands",8,0.88200000000000001,0.88600000000000001,0.88500000000000001,0.89,0.89200000000000002,0.89700000000000002,0.90300000000000002,0.91,0.91300000000000003,0.91200000000000003,0.91700000000000004,0.92800000000000005,0.92800000000000005,0.93,0.93200000000000005,0.93400000000000005,0.93600000000000005,0.93899999999999995,0.94199999999999995,0.94399999999999995,null,"Netherlands","..","..","..","..",0.4,0.2,0.1,0.1,0.2,0.2,0.1,0.2,0.1,0.1,0.2,0.1,0.2,0.3,0.2,"..","..",null,"Netherlands"]
[146,"New Caledonia","CFP Franc                               ","XPF","2021-10-01",102.598,null,"NCL",null,null,"Oceania",null,null,"High-Income","No data, regional estimates only ",146,null,"New Caledonia",540,928,0,4,4,4,4,4,4,4,4,4,5,5,5,5,4,4,4,4,4,4,4,4,null,19.771000000000001,19.853000000000002,20.013999999999999,19.888999999999999,19.474,18.946999999999999,null,"New Caledonia",null,null,null,null,null,null,null,null,null,null,null,null,null,null,null,null,null,null,null,null,null,null,"New Caledonia","..","..","..","..","..","..","..","..","..","..","..","..","..","..","..","..","..","..","..","..","..",null,"New Caledonia"]
[147,"New Zealand","New Zealand Dollar                      ","NZD","2021-10-01",1.452,null,"NZL",null,null,"Oceania",null,null,"High-Income","Partial data, Source: National survey",147,"2006","New Zealand",554,927,0,53,53,54,55,57,58,61,63,65,66,67,66,64,62,59,58,57,57,58,59,60,null,299.887,298.44600000000003,295.14,293.33,292.91000000000003,291.02999999999997,null,"New Zealand",14,0.876,0.88,0.88800000000000001,0.89100000000000001,0.89400000000000002,0.89600000000000002,0.89800000000000002,0.90100000000000002,0.90200000000000002,0.90500000000000003,0.90600000000000003,0.90900000000000003,0.91100000000000003,0.91400000000000003,0.91600000000000004,0.92100000000000004,0.92400000000000004,0.92600000000000005,0.92800000000000005,0.93100000000000005,null,"New Zealand","..","..","..","..","..","..","..","..","..","..","..","..","..","..","..","..","..","..","..","..","..",null,"New Zealand","High Income"]
[148,"Nicaragua","Nicaragua Cordoba Oro                   ","NIO","2021-10-01",35.107999999999997,null,"NIC",null,null,"Latin America and Caribbean",null,null,"Lower-Middle Income","No data, regional estimates only ",148,null,"Nicaragua",558,916,0,131,130,130,131,133,134,134,135,135,136,136,136,136,135,135,134,134,133,132,131,129,null,638.88599999999997,614.89599999999996,598.46500000000003,583.47500000000002,566.93600000000004,545.80700000000002,null,"Nicaragua",128,0.57699999999999996,0.58299999999999996,0.58899999999999997,0.59199999999999997,0.59699999999999998,0.60099999999999998,0.60499999999999998,0.61099999999999999,0.61599999999999999,0.61699999999999999,0.622,0.628,0.63300000000000001,0.63900000000000001,0.64900000000000002,0.65200000000000002,0.65700000000000003,0.66100000000000003,0.65900000000000003,0.66,null,"Nicaragua","..",38.200000000000003,"..","..","..",27.4,"..","..","..",23,"..","..","..","..",13.1,"..","..","..","..","..","..",null,"Nicaragua","Lower Middle Income"]
[149,"Niger","CFA Franc                               ","XOF","2021-10-01",563.97299999999996,null,"NER","Niger","Full data, Source: Full data, Source: DHS-Niger 2012","West and Central Africa","Western Africa","Sub-Saharan Africa","Low-Income","Full data, Source: DHS",149,"2012","Niger",562,914,0,539,556,575,594,614,636,657,680,704,730,756,781,807,834,861,889,915,942,970,999,1030,null,5895.9989999999998,6753.9340000000002,7647.43,8522.4920000000002,9356.9050000000007,10136.24,null,"Niger",189,0.26200000000000001,0.26800000000000002,0.27300000000000002,0.27600000000000002,0.28499999999999998,0.29399999999999998,0.3,0.30599999999999999,0.314,0.32100000000000001,0.33100000000000002,0.33800000000000002,0.35,0.35699999999999998,0.36499999999999999,0.372,0.378,0.38600000000000001,0.39100000000000001,0.39400000000000002,null,"Niger","..","..","..","..","..",90.9,"..",90.6,"..","..","..",83.7,"..","..",77.2,"..","..","..","..","..","..",null,"Niger","Low income"]
[150,"Nigeria","Nigeria Naira                           ","NGN","2021-10-01",413.53,null,"NGA","Nigeria","Full data, Source: Full data, Source: DHS-Nigeria 2018","West and Central Africa","Western Africa","Sub-Saharan Africa","Lower-Middle Income","Full data, Source: DHS",150,"2018","Nigeria",566,914,0,4647,4775,4911,5050,5190,5327,5446,5564,5683,5808,5943,6081,6230,6380,6523,6650,6748,6832,6911,6996,7094,null,39582.464,42575.118999999999,45606.483999999997,48417.856,50829.294000000002,52753.262999999999,null,"Nigeria",161,"..","..","..",0.45,0.46,0.46500000000000002,0.47299999999999998,0.47799999999999998,0.48399999999999999,0.49,0.48199999999999998,0.49199999999999999,0.5,0.51900000000000002,0.52300000000000002,0.52600000000000002,0.52600000000000002,0.53100000000000003,0.53400000000000003,0.53900000000000003,null,"Nigeria","..","..","..",81.400000000000006,"..","..","..","..","..",79.5,"..","..","..","..","..","..","..","..",71,"..","..",null,"Nigeria"]
[151,"Niue","New Zealand Dollar                      ","NZD","2021-10-01",1.452,null,"NIU",null,null,"Oceania",null,null,"","No data",151,null,"Niue",null,null,null,null,null,null,null,null,null,null,null,null,null,null,null,null,null,null,null,null,null,null,null,null,null,null,null,null,null,null,null,null,"Niue",null,null,null,null,null,null,null,null,null,null,null,null,null,null,null,null,null,null,null,null,null,null,"Niue",null,null,null,null,null,null,null,null,null,null,null,null,null,null,null,null,null,null,null,null,null,null,"Niue"]
[152,"North Macedonia","Denar                                   ","MKD","2021-10-01",52.774999999999999,null,"MKD","North Macedonia","Nmace 2018_19","Eastern Europe and Central Asia","Southern Europe","Northern America and Europe","","Full data, Source: MICS",152,"2018-19","North Macedonia",807,925,0,25,25,25,25,25,25,25,24,23,22,21,22,22,23,24,25,24,24,23,22,21,null,104.28700000000001,96.141999999999996,89.16,84.367999999999995,82.182000000000002,81.040999999999997,null,"North Macedonia",82,0.67700000000000005,0.68100000000000005,0.68799999999999994,0.69399999999999995,0.70199999999999996,0.71,0.71599999999999997,0.72099999999999997,0.73699999999999999,0.73899999999999999,0.74299999999999999,0.747,0.748,0.751,0.755,0.76100000000000001,0.76500000000000001,0.76700000000000002,0.77,0.77400000000000002,null,"North Macedonia","..","..","..","..","..","..","..","..","..",18.600000000000001,17.899999999999999,15.5,14.1,12,10.5,10.1,9.6,9,7.1,"..","..",null,"North Macedonia"]
[153,"Norfilk Island","Australian Dollar                       ","AUD","2021-10-01",0.73050000000000004,null,"NFK",null,null,null,null,null,"Upper-Middle-Income","No data",153,null,"Norfilk Island",null,null,null,null,null,null,null,null,null,null,null,null,null,null,null,null,null,null,null,null,null,null,null,null,null,null,null,null,null,null,null,null,"Norfilk Island",null,null,null,null,null,null,null,null,null,null,null,null,null,null,null,null,null,null,null,null,null,null,"Norfilk Island",null,null,null,null,null,null,null,null,null,null,null,null,null,null,null,null,null,null,null,null,null,null,"Norfilk Island"]
[154,"Northern Mariana Island","US Dollar                               ","USD","2021-10-01",1,null,"MNP",null,null,"Oceania",null,null,"High-Income","No data, regional estimates only ",154,null,"Northern mariana Island",null,null,null,null,null,null,null,null,null,null,null,null,null,null,null,null,null,null,null,null,null,null,null,1.1870000000000001,null,null,null,null,null,null,null,null,"Northern Mariana Island",null,null,null,null,null,null,null,null,null,null,null,null,null,null,null,null,null,null,null,null,null,null,"Northern Mariana Island",null,null,null,null,null,null,null,null,null,null,null,null,null,null,null,null,null,null,null,null,null,null,"Northern Mariana Island"]
[155,"Norway","Norwegian Krone                         ","NOK","2021-10-01",8.7390000000000008,null,"NOR",null,null,"Western Europe",null,null,"High-Income","Partial data, Source: National survey",155,"2018-2019","Norway",578,924,0,58,57,56,56,56,56,57,59,62,63,64,64,63,61,59,58,58,58,58,59,60,null,308.66500000000002,317.779,323.12400000000002,327.048,329.32900000000001,331.16300000000001,null,"Norway",1,0.91500000000000004,0.91400000000000003,0.91700000000000004,0.92300000000000004,0.93200000000000005,0.93100000000000005,0.93400000000000005,0.93600000000000005,0.93700000000000006,0.93700000000000006,0.94,0.94199999999999995,0.94099999999999995,0.94399999999999995,0.94399999999999995,0.94699999999999995,0.95,0.95399999999999996,0.95599999999999996,0.95699999999999996,null,"Norway",0.2,"..","..",0.2,0.3,0.3,0.3,0.2,0.3,0.1,0.2,0.1,0.2,0.2,0.1,0.2,0.4,0.3,0.3,"..","..",null,"Norway","High Income"]
[156,"Oman","Oman Rial                               ","OMR","2021-10-01",0.38400000000000001,null,"OMN",null,null,"Middle East and North Africa",null,null,"High-Income","Partial data, Source: National survey",156,"2007-11","Oman",512,922,0,55,53,52,51,51,53,54,56,59,63,67,70,73,76,80,83,89,94,98,100,99,null,422.26900000000001,379.63799999999998,351.29399999999998,349.61500000000001,365.15800000000002,379.86799999999999,null,"Oman",60,0.69299999999999995,0.70499999999999996,0.71399999999999997,0.72399999999999998,0.73099999999999998,0.73599999999999999,0.74,0.752,0.77,0.77700000000000002,0.78200000000000003,0.78200000000000003,0.79100000000000004,0.79900000000000004,0.80200000000000005,0.81399999999999995,0.81499999999999995,0.81899999999999995,0.81299999999999994,0.81299999999999994,null,"Oman","..","..","..","..","..","..","..","..","..","..","..","..","..","..","..","..","..","..","..","..","..",null,"Oman","High Income"]
[157,"Pakistan","Pakistani Rupee                         ","PKR","2021-10-01",170.24299999999999,null,"PAK","Pakistan","Full data, Source: Full data, Source: DHS-Pakistan  2017-2018","South Asia","Southern Asia","Central Asia and Southern Asia","Lower-Middle Income","Full data, Source: DHS",157,"2017-18","Pakistan",586,5501,0,4506,4538,4565,4592,4625,4669,4721,4785,4856,4932,5010,5088,5168,5248,5333,5422,5517,5616,5707,5773,5804,null,30151.909,29959.143,29785.973000000002,30032.885999999999,30413.945,30260.252,null,"Pakistan",154,0.44700000000000001,0.45400000000000001,0.46200000000000002,0.47099999999999997,0.47299999999999998,0.48599999999999999,0.49199999999999999,0.496,0.503,0.50800000000000001,0.51200000000000001,0.51600000000000001,0.51900000000000002,0.52300000000000002,0.53,0.53600000000000003,0.54200000000000004,0.55000000000000004,0.55200000000000005,0.55700000000000005,null,"Pakistan","..",74,"..","..",62.3,61.5,"..",57.3,"..","..",48,46.6,"..",40,"..",35.5,"..","..",35.700000000000003,"..","..",null,"Pakistan","Lower Middle Income"]
[158,"Palau","US Dollar                               ","USD","2021-10-01",1,null,"PLW",null,null,"Oceania",null,null,"High-Income","No data, regional estimates only ",158,null,"Palau",null,null,null,null,null,null,null,null,null,null,null,null,null,null,null,null,null,null,null,null,null,null,null,0.21199999999999999,null,null,null,null,null,null,null,null,"Palau",50,0.74399999999999999,0.747,0.751,0.755,0.75800000000000001,0.77,0.77400000000000002,0.78,0.78100000000000003,0.78200000000000003,0.78600000000000003,0.79300000000000004,0.79500000000000004,0.82099999999999995,0.82499999999999996,0.82,0.82199999999999995,0.82199999999999995,0.82199999999999995,0.82599999999999996,null,"Palau","..","..","..","..","..","..","..","..","..","..","..","..","..","..","..","..","..","..","..","..","..",null,"Palau"]
[159,"Panama","Panama Balboa                           ","PAB","2021-10-01",1,null,"PAN","Panama","Panama 2013","Latin America and Caribbean","Central America","Latin America and the Caribbean","Upper-Middle-Income","Full data, Source: MICS",159,"2013","Panama",591,916,0,71,71,71,71,70,70,71,72,74,75,76,77,78,78,78,79,78,78,78,77,77,null,400.19499999999999,400.858,398.95600000000002,394.79,389.46199999999999,383.685,null,"Panama",57,0.73499999999999999,0.73799999999999999,0.74399999999999999,0.746,0.751,0.754,0.75900000000000001,0.76700000000000002,0.77100000000000002,0.77200000000000002,0.77400000000000002,0.78,0.78600000000000003,0.79100000000000004,0.79500000000000004,0.79900000000000004,0.80500000000000005,0.81100000000000005,0.81200000000000006,0.81499999999999995,null,"Panama",20,24.8,21.5,20.6,19.7,18.600000000000001,19,16.5,11.8,9.5,10.7,8.6,10,8.1,8.3000000000000007,6.7,7,6.3,5.2,4.5999999999999996,"..",null,"Panama","High Income"]
[160,"Papua New Guinea","Kina                                    ","PGK","2021-10-01",3.5089999999999999,null,"PNG","Papua New Guinea","Full data, Source: Full data, Source: DHS-Papua New Guinea  2016-2018","Oceania","Oceania","Oceania excluding Australia and New Zealand","Lower-Middle Income","Full data, Source: DHS",160,"2016-2018","Papua New Guinea",598,928,0,190,192,192,192,192,193,196,199,203,206,209,211,212,212,213,214,217,219,223,226,229,null,1214.2819999999999,1264.693,1307.3330000000001,1336.42,1363.9970000000001,1387.0419999999999,null,"Papua New Guinea",155,0.45,0.45600000000000002,0.46200000000000002,0.47,0.47299999999999998,0.48,0.48499999999999999,0.498,0.503,0.51200000000000001,0.52200000000000002,0.53,0.52,0.53700000000000003,0.54200000000000004,0.54800000000000004,0.54900000000000004,0.54900000000000004,0.54900000000000004,0.55500000000000005,null,"Papua New Guinea","..","..","..","..","..","..","..","..","..",65.599999999999994,"..","..","..","..","..","..","..","..","..","..","..",null,"Papua New Guinea","Lower Middle Income"]
[161,"Paraguay","Paraguay Guarani                        ","PYG","2021-10-01",6871,null,"PRY","Paraguay","Paraguay 2016","Latin America and Caribbean","South America","Latin America and the Caribbean","Upper-Middle-Income","Full data, Source: MICS",161,"2016","Paraguay",600,931,0,144,142,138,134,131,130,131,134,138,142,144,143,141,139,137,136,136,138,140,142,143,null,712.76400000000001,695.97500000000002,675.65099999999995,657.39200000000005,639.96799999999996,622.02,null,"Paraguay",103,0.64300000000000002,0.65200000000000002,0.66200000000000003,0.66,0.66700000000000004,0.67,0.67,0.67500000000000004,0.68400000000000005,0.68100000000000005,0.69599999999999995,0.70099999999999996,0.70099999999999996,0.71199999999999997,0.71499999999999997,0.72099999999999997,0.72199999999999998,0.72599999999999998,0.72699999999999998,0.72799999999999998,null,"Paraguay","..",17.600000000000001,25.9,18.7,16.2,13.8,18.7,16,13.3,13.4,12.7,12.3,9.1,6.3,6.8,6.6,6.7,4.8,5.4,4.5,"..",null,"Paraguay","Upper Middle Income"]
[162,"Peru","Sol                                     ","PEN","2021-10-01",4.125,null,"PER",null,null,"Latin America and Caribbean",null,null,"Upper-Middle-Income","No data, regional estimates only ",162,null,"Peru",604,931,0,587,588,589,592,596,602,611,621,630,632,626,605,576,545,523,516,525,550,582,608,621,null,2858.3420000000001,2721.3319999999999,2597.5010000000002,2504.3200000000002,2442.5300000000002,2393.66,null,"Peru",79,0.67900000000000005,0.68700000000000006,0.68799999999999994,0.68700000000000006,0.69399999999999995,0.69899999999999995,0.69699999999999995,0.70399999999999996,0.71499999999999997,0.71799999999999997,0.72099999999999997,0.73399999999999999,0.74199999999999999,0.75,0.76,0.75900000000000001,0.76500000000000001,0.76700000000000002,0.77100000000000002,0.77700000000000002,null,"Peru",30.8,33.1,29.7,28,28.6,30.9,27,23.2,19.600000000000001,17.3,14.9,13.4,12.3,11.5,10.7,10.4,10.1,9.9,8.4,7.5,"..",null,"Peru","Upper Middle Income"]
[163,"Philippines","Philippine Peso                         ","PHP","2021-10-01",50.85,null,"PHL","Philippines","Phils 2017","Southeastern Asia","South-Eastern Asia","Eastern Asia and South-eastern Asia","Lower-Middle Income","Full data, Source: MICS",163,"2017","Philippines",608,920,0,2233,2270,2304,2330,2347,2352,2339,2314,2286,2267,2264,2280,2314,2350,2365,2345,2278,2179,2071,1988,1955,null,11082.531999999999,11169.759,11092.749,10814.394,10539.337,10239.51,null,"Philippines",107,0.63200000000000001,0.63300000000000001,0.63800000000000001,0.64200000000000002,0.65200000000000002,0.65400000000000003,0.65600000000000003,0.66200000000000003,0.66600000000000004,0.66500000000000004,0.67100000000000004,0.67600000000000005,0.68400000000000005,0.69099999999999995,0.69599999999999995,0.70099999999999996,0.70399999999999996,0.70799999999999996,0.71099999999999997,0.71799999999999997,null,"Philippines",37.9,"..","..",36,"..","..",38.200000000000003,"..","..",34,"..","..",33.299999999999997,"..","..",25.7,"..","..",17,"..","..",null,"Philippines","Lower Middle Income"]
[164,"Pitcarin","New Zealand Dollar                      ","NZD","2021-10-01",0.69399999999999995,null,"PCN",null,null,null,null,null,"","No data",164,null,"Pitcarin",null,null,null,null,null,null,null,null,null,null,null,null,null,null,null,null,null,null,null,null,null,null,null,null,null,null,null,null,null,null,null,null,"Pitcarin",null,null,null,null,null,null,null,null,null,null,null,null,null,null,null,null,null,null,null,null,null,null,"Pitcarin",null,null,null,null,null,null,null,null,null,null,null,null,null,null,null,null,null,null,null,null,null,null,"Pitcarin"]
[165,"Poland","Poland Zloty                            ","PLN","2021-10-01",3.984,null,"POL",null,null,"Western Europe",null,null,"High-Income","No data",165,null,"Poland",616,923,0,359,345,339,341,349,362,381,405,429,445,447,433,405,372,343,328,330,344,366,383,391,null,1724.6849999999999,1562.9110000000001,1458.5070000000001,1436.385,1444.529,1427.3440000000001,null,"Poland",35,0.79,0.79600000000000004,0.80400000000000005,0.80900000000000005,0.80700000000000005,0.81299999999999994,0.81899999999999995,0.82399999999999995,0.82899999999999996,0.83399999999999996,0.84,0.84499999999999997,0.84199999999999997,0.85599999999999998,0.85799999999999998,0.86299999999999999,0.86899999999999999,0.873,0.877,0.88,null,"Poland","..","..","..","..",4.5,2.4,1.6,1.1000000000000001,0.6,0.9,1,0.8,0.7,0.9,1,0.8,0.5,0.6,0.4,"..","..",null,"Poland","High Income"]
[166,"Portugal","Euro                                    ","EUR","2021-10-01",0.86,null,"PRT",null,null,"Western Europe",null,null,"High-Income","No data",166,null,"Portugal",620,925,0,108,109,110,112,114,113,111,108,104,100,96,93,90,88,86,84,82,81,80,79,78,null,388.16899999999998,384.43099999999998,384.98899999999998,379.62799999999999,365.58600000000001,347.50599999999997,null,"Portugal",38,0.79200000000000004,0.79800000000000004,0.79900000000000004,0.80500000000000005,0.80900000000000005,0.81299999999999994,0.81100000000000005,0.81399999999999995,0.81699999999999995,0.82299999999999995,0.82899999999999996,0.83299999999999996,0.83599999999999997,0.84,0.84699999999999998,0.85399999999999998,0.85499999999999998,0.85799999999999998,0.86,0.86399999999999999,null,"Portugal","..","..","..",1.5,1,1.1000000000000001,0.5,0.8,0.9,0.4,0.4,0.9,1.5,1.6,1.4,1.1000000000000001,0.7,0.7,0.7,"..","..",null,"Portugal","High Income"]
[167,"Puerto Rico","US Dollar                               ","USD","2021-10-01",1,null,"PRI",null,null,"Latin America and Caribbean",null,null,"High-Income","No data, regional estimates only ",167,null,"Puerto Rico",630,915,0,52,50,50,49,49,49,49,48,48,47,45,42,39,36,32,28,23,19,15,13,12,null,94.504999999999995,106.706,111.538,100.93300000000001,88.010999999999996,78.114999999999995,null,"Puerto Rico",null,null,null,null,null,null,null,null,null,null,null,null,null,null,null,null,null,null,null,null,null,null,"Puerto Rico","..","..","..","..","..","..","..","..","..","..","..","..","..","..","..","..","..","..","..","..","..",null,"Puerto Rico"]
[168,"Qatar","Qatari Rial                             ","QAR","2021-10-01",3.6720000000000002,null,"QAT","Qatar","Qatar 2012","Middle East and North Africa","Western Asia","Western Asia and Northern Africa","High-Income","Full data, Source: MICS",168,"2012","Qatar",634,922,0,11,11,11,12,13,15,15,16,17,18,19,21,22,23,24,25,26,26,26,26,26,null,132.52600000000001,130.577,128.08000000000001,128.78100000000001,131.35900000000001,134.30099999999999,null,"Qatar",45,0.81599999999999995,0.81699999999999995,0.82199999999999995,0.83,0.83199999999999996,0.83799999999999997,0.83499999999999996,0.83799999999999997,0.84299999999999997,0.84099999999999997,0.83399999999999996,0.84,0.85399999999999998,0.84199999999999997,0.83499999999999996,0.83899999999999997,0.84499999999999997,0.84799999999999998,0.84499999999999997,0.84799999999999998,null,"Qatar","..","..","..","..","..","..","..","..","..","..","..","..","..","..","..","..","..","..","..","..","..",null,"Qatar","High Income"]
[169,"Republic of Korea","Korean Won, South Korea                 ","KRW","2021-10-01",1181.8900000000001,null,"KOR",null,null,"Northeast Asia  ",null,null,"High-Income","Partial data, Source: National survey",169,"2012","Republic of Korea",410,906,0,515,474,451,443,443,445,451,460,470,480,486,487,484,477,464,446,421,390,358,332,317,null,1736.309,1701.261,1709.4639999999999,1588.683,1517.684,1490.396,null,"Republic of Korea",23,0.82299999999999995,0.82899999999999996,0.83699999999999997,0.84399999999999997,0.85299999999999998,0.86,0.86799999999999999,0.875,0.88,0.877,0.88900000000000001,0.89500000000000002,0.89800000000000002,0.90100000000000002,0.90400000000000003,0.90700000000000003,0.91,0.91200000000000003,0.91400000000000003,0.91600000000000004,null,"Republic of Korea","..","..","..","..","..","..",0.5,"..",0.5,"..",0.7,"..",0.5,"..",0.5,"..",0.2,"..","..","..","..",null,"Republic of Korea","High Income"]
[170,"Republic of Moldova","Moldovan Leu                            ","MDL","2021-10-01",17.59,null,"MDA","Republic of Moldova","Moldova 2012","Eastern Europe and Central Asia","Eastern Europe","Northern America and Europe","Upper-Middle-Income","Full data, Source: MICS",170,"2012","Republic of Moldova",498,923,0,46,45,44,43,42,42,43,44,45,46,47,47,46,45,44,42,41,40,39,38,37,null,187.453,167.08199999999999,153.28700000000001,147.76499999999999,145.488,140.607,null,"Republic of Moldova",90,0.64300000000000002,0.65100000000000002,0.66300000000000003,0.67300000000000004,0.68400000000000005,0.69199999999999995,0.69899999999999995,0.70399999999999996,0.71,0.70599999999999996,0.71299999999999997,0.71899999999999997,0.72599999999999998,0.73499999999999999,0.73699999999999999,0.73599999999999999,0.73799999999999999,0.74299999999999999,0.746,0.75,null,"Republic of Moldova",68.099999999999994,59.1,43.5,31.6,32,40.299999999999997,12.2,7.7,9,7.9,6,4.0999999999999996,3.1,2.1,1.1000000000000001,1.3,1.2,1,0.9,"..","..",null,"Republic of Moldova","Lower Middle Income"]
[171,"Réunion","Euro                                    ","EUR","2021-10-01",0.86,null,"REU",null,null,"Eastern Europe and Central Asia",null,null,"","No data",171,null,"Réunion",638,910,0,14,15,15,16,16,16,15,15,14,14,13,13,14,14,14,14,14,14,13,13,12,null,63.875,63.642000000000003,63.048999999999999,61.073999999999998,58.563000000000002,56.14,null,"Réunion",null,null,null,null,null,null,null,null,null,null,null,null,null,null,null,null,null,null,null,null,null,null,"Réunion","..","..","..","..","..","..","..","..","..","..","..","..","..","..","..","..","..","..","..","..","..",null,"Réunion"]
[172,"Romania","Romanian Leu                            ","RON","2021-10-01",4.2510000000000003,null,"ROU",null,null,"Eastern Europe and Central Asia",null,null,"Upper-Middle-Income","No data, regional estimates only ",172,null,"Romania",642,923,0,261,261,248,228,210,200,202,212,225,235,238,229,214,195,179,169,170,176,187,196,200,null,882.96,840.91,820.48599999999999,810.46400000000006,791.12800000000004,760.74,null,"Romania",49,0.71599999999999997,0.72199999999999998,0.73099999999999998,0.73899999999999999,0.753,0.76200000000000001,0.77400000000000002,0.78800000000000003,0.80300000000000005,0.80600000000000005,0.80500000000000005,0.80600000000000005,0.80300000000000005,0.80800000000000005,0.81100000000000005,0.81499999999999995,0.82,0.82099999999999995,0.82299999999999995,0.82799999999999996,null,"Romania","..","..","..","..","..","..",16.5,12.2,9.3000000000000007,9,10.199999999999999,11.5,12.2,14,12.6,11,8.3000000000000007,6.3,5.0999999999999996,"..","..",null,"Romania","Upper Middle Income"]
[173,"Russian Federation","Russian Rouble                          ","RUB","2021-10-01",72.81,null,"RUS",null,null,"Eastern Europe and Central Asia",null,null,"Upper-Middle-Income","Partial data: Source: Health records",173,"2013","Russian Federation",643,923,0,1455,1510,1533,1534,1531,1537,1547,1562,1583,1615,1659,1719,1790,1862,1917,1944,1940,1909,1858,1800,1743,null,8243.4599999999991,7374.6469999999999,7082.1329999999998,7372.9189999999999,7824.7560000000003,7978.0349999999999,null,"Russian Federation",52,0.72199999999999998,0.72799999999999998,0.73399999999999999,0.74199999999999999,0.748,0.753,0.76,0.76900000000000002,0.77500000000000002,0.77300000000000002,0.78100000000000003,0.79,0.79800000000000004,0.80200000000000005,0.80700000000000005,0.80900000000000005,0.81499999999999995,0.82,0.82299999999999995,0.82399999999999995,null,"Russian Federation",13.1,8.9,6.6,6.6,5.6,4.5,3.3,2,0.9,0.9,0.8,0.5,0.5,0.4,0.3,0.4,0.4,0.4,0.4,"..","..",null,"Russian Federation","Upper Middle Income"]
[174,"Rwanda","Rwanda Franc                            ","RWF","2021-10-01",1000.77,null,"RWA","Rwanda","Full data, Source: Full data, Source: DHS-Rwanda 2019-2020","Eastern and Southern Africa","Eastern Africa","Sub-Saharan Africa","Low-Income","Full data, Source: DHS",174,"2019-20","Rwanda",646,910,0,285,302,306,302,297,297,301,310,320,329,335,337,337,336,337,342,353,367,383,395,403,null,2007.585,2066.4520000000002,2133.8780000000002,2203.7139999999999,2264.5790000000002,2286.7429999999999,null,"Rwanda",160,0.34100000000000003,0.35,0.36599999999999999,0.379,0.39600000000000002,0.41299999999999998,0.434,0.45,0.46100000000000002,0.47699999999999998,0.49199999999999999,0.5,0.50800000000000001,0.51500000000000001,0.52100000000000002,0.52600000000000002,0.52700000000000002,0.53500000000000003,0.54,0.54300000000000004,null,"Rwanda",90.6,"..","..","..","..",85.6,"..","..","..","..",84,"..","..",81.900000000000006,"..","..",80.2,"..","..","..","..",null,"Rwanda"]
[175,"Saint Kitts and Nevis","E.C. Dollar                             ","XCD","2021-10-01",2.7,null,"KNA",null,null,"Latin America and Caribbean",null,null,"High-Income","No data, regional estimates only ",175,null,"Saint Kitts and Nevis",null,null,null,null,null,null,null,null,null,null,null,null,null,null,null,null,null,null,null,null,null,null,null,0.746,null,null,null,null,null,null,null,null,"Saint Kitts and Nevis",74,"..","..","..","..","..",0.71099999999999997,0.71799999999999997,0.72399999999999998,0.73899999999999999,0.74,0.746,0.749,0.745,0.76400000000000001,0.76800000000000002,0.76800000000000002,0.77100000000000002,0.77,0.77300000000000002,0.77900000000000003,null,"Saint Kitts and Nevis","..","..","..","..","..","..","..","..","..","..","..","..","..","..","..","..","..","..","..","..","..",null,"Saint Kitts and Nevis"]
[176,"Saint Lucia","E.C. Dollar                             ","XCD","2021-10-01",2.7,null,"LCA","Saint Lucia","Sta Lucia 2012","Latin America and Caribbean","Caribbean","Latin America and the Caribbean","Upper-Middle-Income","Full data, Source: MICS",176,"2012","Saint Lucia",662,915,0,3,3,3,2,2,2,2,2,2,2,2,2,2,2,2,2,2,2,2,2,2,null,10.301,9.3420000000000005,8.5079999999999991,7.8970000000000002,7.5410000000000004,7.3179999999999996,null,"Saint Lucia",86,0.69499999999999995,0.69099999999999995,0.69299999999999995,0.69499999999999995,0.69499999999999995,0.69799999999999995,0.71199999999999997,0.71399999999999997,0.72499999999999998,0.72799999999999998,0.73,0.73599999999999999,0.73,0.73199999999999998,0.73499999999999999,0.747,0.752,0.75900000000000001,0.75800000000000001,0.75900000000000001,null,"Saint Lucia","..","..","..","..","..","..","..","..","..","..","..","..","..","..","..","..",10.199999999999999,"..","..","..","..",null,"Saint Lucia"]
[177,"Saint Vincent and the Grenadines","E.C. Dollar                             ","XCD","2021-10-01",2.7,null,"VCT",null,null,"Latin America and Caribbean",null,null,"Upper-Middle-Income",null,177,null,"Saint Vincent and the Grenadines",670,915,0,2,2,2,2,2,2,2,2,2,2,2,2,2,2,2,2,2,2,2,1,1,null,7.5789999999999997,7.1989999999999998,6.7919999999999998,6.391,6.0339999999999998,5.7,null,"Saint Vincent and the Grenadines",97,0.68100000000000005,0.68600000000000005,0.69,0.69799999999999995,0.70099999999999996,0.70499999999999996,0.71099999999999997,0.71499999999999997,0.72099999999999997,0.72,0.71799999999999997,0.72099999999999997,0.72,0.72299999999999998,0.73299999999999998,0.73299999999999998,0.73399999999999999,0.73399999999999999,0.73599999999999999,0.73799999999999999,null,"Saint Vincent and the Grenadines","..","..","..","..","..","..","..","..","..","..","..","..","..","..","..","..","..","..","..","..","..",null,"Saint Vincent and the Grenadines"]
[178,"Samoa","Samoa Tala                              ","WST","2021-10-01",2.548,null,"WSM",null,null,"Oceania",null,null,"Lower-Middle Income","No data, regional estimates only ",178,null,"Samoa",882,957,0,5,5,5,5,5,5,5,5,5,5,6,6,6,6,6,6,6,6,6,6,6,null,23.843,24.451000000000001,25.469000000000001,26.686,27.503,27.123000000000001,null,"Samoa",111,0.65100000000000002,0.65900000000000003,0.65900000000000003,0.66500000000000004,0.67300000000000004,0.67700000000000005,0.68,0.68600000000000005,0.68700000000000006,0.69099999999999995,0.69799999999999995,0.70099999999999996,0.69799999999999995,0.7,0.70299999999999996,0.70699999999999996,0.71,0.71,0.70899999999999996,0.71499999999999997,null,"Samoa","..","..",11.9,"..","..","..","..","..",9.6,"..","..","..","..",9.6,"..","..","..","..","..","..","..",null,"Samoa","Upper Middle Income"]
[179,"San Marino","Euro                                    ","EUR","2021-10-01",0.86,null,"SMR",null,null,"Western Europe",null,null,"High-Income","No data",179,null,"San Marino",null,null,null,null,null,null,null,null,null,null,null,null,null,null,null,null,null,null,null,null,null,null,null,null,null,null,null,null,null,null,null,null,"San Marino",null,null,null,null,null,null,null,null,null,null,null,null,null,null,null,null,null,null,null,null,null,null,"San Marino","..","..","..","..","..","..","..","..","..","..","..","..","..","..","..","..","..","..","..","..","..",null,"San Marino"]
[180,"Sao Tome and Principe","Sao Tome Principe Dobra                 ","STN","2021-10-01",20.914000000000001,null,"STP","Sao Tome and Principe","Sao Tome & Principe 2019","West and Central Africa","Middle Africa","Sub-Saharan Africa","Lower-Middle Income","Full data, Source: MICS",180,"2019","Sao Tome and Principe",678,911,0,5,5,5,6,6,6,6,6,6,6,6,6,6,6,6,6,6,6,6,6,6,null,34.731999999999999,37.399000000000001,39.99,41.991,43.805999999999997,45.45,null,"Sao Tome and Principe",135,0.498,0.50600000000000001,0.51100000000000001,0.51900000000000002,0.52600000000000002,0.53300000000000003,0.54300000000000004,0.54800000000000004,0.54600000000000004,0.55600000000000005,0.56100000000000005,0.56799999999999995,0.57299999999999995,0.58199999999999996,0.59099999999999997,0.60399999999999998,0.60799999999999998,0.61899999999999999,0.624,0.625,null,"Sao Tome and Principe",66.400000000000006,"..","..","..","..","..","..","..","..","..",72,"..","..","..","..","..","..",65.400000000000006,"..","..","..",null,"Sao Tome and Principe","Lower Middle Income"]
[181,"Saudi Arabia","Saudi Riyal                             ","SAR","2021-10-01",3.7509999999999999,null,"SAU",null,null,"Middle East and North Africa",null,null,"High-Income","Partial data, Source: National survey",181,"2004-05","Saudi Arabia",682,922,0,518,522,532,547,563,578,587,595,602,607,612,613,613,612,609,603,600,594,586,578,571,null,2828.4369999999999,2592.2539999999999,2438.1170000000002,2406.0720000000001,2435.386,2443.7069999999999,null,"Saudi Arabia",40,0.74299999999999999,0.746,0.748,0.755,0.76400000000000001,0.77,0.77700000000000002,0.78300000000000003,0.79200000000000004,0.79600000000000004,0.80900000000000005,0.82299999999999995,0.83499999999999996,0.84499999999999997,0.85199999999999998,0.85899999999999999,0.85899999999999999,0.85199999999999998,0.85399999999999998,0.85399999999999998,null,"Saudi Arabia","..","..","..","..","..","..","..","..","..","..","..","..","..","..","..","..","..","..","..","..","..",null,"Saudi Arabia","High Income"]
[182,"Senegal","CFA Franc                               ","XOF","2021-10-01",563.97299999999996,null,"SEN","Senegal","Full data, Source: Full data, Source: DHS-Senegal 2019","West and Central Africa","Western Africa","Sub-Saharan Africa","Lower-Middle Income","Full data, Source: DHS",182,"2019","Senegal",686,914,0,355,361,367,375,384,395,408,422,438,453,467,478,489,498,506,513,516,519,521,524,530,null,2886.386,3081.7669999999998,3307.826,3544.1129999999998,3748.8209999999999,3928.2359999999999,null,"Senegal",168,0.39,0.40500000000000003,0.41,0.41799999999999998,0.42599999999999999,0.434,0.438,0.44700000000000001,0.45700000000000002,0.46100000000000002,0.46800000000000003,0.47099999999999997,0.48699999999999999,0.49399999999999999,0.499,0.50600000000000001,0.50900000000000001,0.51200000000000001,0.51600000000000001,0.51200000000000001,null,"Senegal","..",77,"..","..","..",67.7,"..","..","..","..","..",68.400000000000006,"..","..","..","..","..","..","..","..","..",null,"Senegal","Lower Middle Income"]
[183,"Serbia","Serbian Dinar                           ","RSD","2021-10-01",101.05,null,"SRB","Serbia","Serbia 2019","Eastern Europe and Central Asia","Southern Europe","Northern America and Europe","Upper-Middle-Income","Full data, Source: MICS",183,"2019","Serbia",688,925,0,117,115,113,111,109,107,104,102,99,96,93,90,87,84,82,81,82,83,85,86,86,null,390.35199999999998,363.95800000000003,345.54899999999998,329.721,312.57,295.63299999999998,null,"Serbia",64,0.71599999999999997,0.72299999999999998,0.72599999999999998,0.73199999999999998,0.74,0.749,0.754,0.75800000000000001,0.76400000000000001,0.76600000000000001,0.76600000000000001,0.77600000000000002,0.77500000000000002,0.77800000000000002,0.78400000000000003,0.78900000000000003,0.79500000000000004,0.79800000000000004,0.80300000000000005,0.80600000000000005,null,"Serbia","..","..","..","..","..","..","..","..","..","..","..","..",10,11.5,12.2,11.6,10.9,8.9,"..","..","..",null,"Serbia","Upper Middle Income"]
[184,"Seychelles","Seychelles Rupee                        ","SCR","2021-10-01",13.625999999999999,null,"SYC",null,null,"Eastern and Southern Africa",null,null,"High-Income","No data",184,null,"Seychelles",690,910,0,1,1,2,2,2,2,2,2,2,2,2,2,2,2,2,2,2,2,2,2,2,null,7.4790000000000001,7.0990000000000002,7,7.0090000000000003,6.9089999999999998,6.6449999999999996,null,"Seychelles",67,0.71399999999999997,0.71,0.71099999999999997,0.71399999999999997,0.71599999999999997,0.73199999999999998,0.72199999999999998,0.745,0.75,0.754,0.76400000000000001,0.76700000000000002,0.755,0.77500000000000002,0.77500000000000002,0.78600000000000003,0.78700000000000003,0.78900000000000003,0.79,0.79600000000000004,null,"Seychelles","..","..","..","..","..","..","..","..","..","..","..","..","..",3.1,"..","..","..","..",1.1000000000000001,"..","..",null,"Seychelles"]
[185,"Sierra Leone","Sierra Leone Leone                      ","SLL","2021-10-01",10450,null,"SLE","Sierra Leone","Full data, Source: Full data, Source: DHS-Sierra Leone 2019","West and Central Africa","Western Africa","Sub-Saharan Africa","Low-Income","Full data, Source: DHS",185,"2019","Sierra Leone",694,914,0,171,175,183,192,201,207,214,218,221,222,224,224,224,224,224,226,228,232,235,239,242,null,1303.5609999999999,1323.9369999999999,1340.519,1348.7760000000001,1353.163,1344.9349999999999,null,"Sierra Leone",182,0.29499999999999998,0.309,0.32600000000000001,0.33600000000000002,0.34499999999999997,0.35399999999999998,0.36199999999999999,0.375,0.38600000000000001,0.39400000000000002,0.39900000000000002,0.40600000000000003,0.42099999999999999,0.433,0.438,0.43099999999999999,0.43099999999999999,0.443,0.44700000000000001,0.45200000000000001,null,"Sierra Leone","..","..","..",88.8,"..","..","..","..","..","..","..",82.6,"..","..","..","..","..","..",76,"..","..",null,"Sierra Leone","Low income"]
[186,"Singapore","Singapore Dollar                        ","SGD","2021-10-01",1.359,null,"SGP",null,null,"Southeastern Asia",null,null,"High-Income","Partial data, Source: National survey",186,"2011","Singapore",702,920,0,39,37,37,36,37,37,37,38,38,38,38,38,37,36,36,38,41,47,53,57,59,null,248.61199999999999,239.34899999999999,222.33699999999999,207.16200000000001,202.41399999999999,207.928,null,"Singapore",11,0.82099999999999995,0.82499999999999996,0.83299999999999996,0.84199999999999997,0.84899999999999998,0.874,0.88100000000000001,0.88200000000000001,0.88800000000000001,0.88800000000000001,0.90900000000000003,0.91300000000000003,0.91800000000000004,0.92100000000000004,0.92600000000000005,0.93100000000000005,0.93500000000000005,0.93300000000000005,0.93600000000000005,0.93799999999999994,null,"Singapore","..","..","..","..","..","..","..","..","..","..","..","..","..","..","..","..","..","..","..","..","..",null,"Singapore","High Income"]
[187,"Slovakia","Euro                                    ","EUR","2021-10-01",0.86,null,"SVK",null,null,"Western Europe",null,null,"High-Income","No data",187,null,"Slovakia",703,923,0,50,49,50,51,53,54,56,58,59,60,60,59,58,56,54,54,54,55,56,57,57,null,267.64100000000002,247.744,231.804,226.22399999999999,227.79,228.226,null,"Slovakia",39,0.76500000000000001,0.76600000000000001,0.77300000000000002,0.77800000000000002,0.78600000000000003,0.79600000000000004,0.80500000000000005,0.81599999999999995,0.82299999999999995,0.82499999999999996,0.83099999999999996,0.83799999999999997,0.84299999999999997,0.84499999999999997,0.84699999999999998,0.85,0.85299999999999998,0.85499999999999998,0.85799999999999998,0.86,null,"Slovakia","..","..","..","..",0.7,0.4,0.8,0.9,0.8,0.9,0.8,0.7,0.7,0.8,1.2,1,1.8,"..",1,"..","..",null,"Slovakia","High Income"]
[188,"Slovenia","Euro                                    ","EUR","2021-10-01",0.86,null,"SVN",null,null,"Western Europe",null,null,"High-Income","No data",188,null,"Slovenia",705,925,0,18,18,18,17,17,17,18,20,21,22,23,23,23,22,21,21,20,20,19,19,19,null,92.722999999999999,86.013999999999996,84.53,87.501000000000005,90.626000000000005,90.504999999999995,null,"Slovenia",22,0.83199999999999996,0.84299999999999997,0.85,0.85699999999999998,0.86399999999999999,0.86899999999999999,0.876,0.88,0.88600000000000001,0.88500000000000001,0.88900000000000001,0.89100000000000001,0.88400000000000001,0.89300000000000002,0.89400000000000002,0.89400000000000002,0.9,0.90700000000000003,0.91200000000000003,0.91700000000000004,null,"Slovenia","..","..","..","..",0.2,0.2,0.1,0.1,"..","..","..","..","..",0.1,"..","..","..","..","..","..","..",null,"Slovenia","High Income"]
[189,"Solomon Islands","Solomon Is. Dollar                      ","SBD","2021-10-01",7.9180000000000001,null,"SLB",null,null,"Oceania",null,null,"Lower-Middle Income","No data, regional estimates only ",189,null,"Solomon Islands",90,928,0,14,14,14,15,15,15,16,16,16,16,17,17,18,19,20,20,21,21,21,21,21,null,109.98699999999999,116.649,125.801,135.512,143.17599999999999,149.922,null,"Solomon Islands",151,0.47499999999999998,0.48,0.48599999999999999,0.49199999999999999,0.5,0.50900000000000001,0.51900000000000002,0.52600000000000002,0.52400000000000002,0.51700000000000002,0.53700000000000003,0.54100000000000004,0.55300000000000005,0.55800000000000005,0.55900000000000005,0.56299999999999994,0.56100000000000005,0.56200000000000006,0.56399999999999995,0.56699999999999995,null,"Solomon Islands","..","..","..","..","..",73,"..","..","..","..","..","..",58.1,"..","..","..","..","..","..","..","..",null,"Solomon Islands","Lower Middle Income"]
[190,"Somalia","Somali Shilling                         ","SOS","2021-10-01",24300,null,"SOM","Somalia","Somalia 2006","Eastern and Southern Africa","Eastern Africa","Sub-Saharan Africa","Low-Income","Full data, Source: MICS",190,"2006","Somalia",706,910,0,400,408,412,415,419,426,438,452,467,482,493,500,505,509,515,525,539,556,576,596,615,null,3503.0120000000002,3896.1959999999999,4226.1490000000003,4510.3909999999996,4799.6819999999998,5127.7240000000002,null,"Somalia",null,null,null,null,null,null,null,null,null,null,null,null,null,null,null,null,null,null,null,null,null,null,"Somalia","..","..","..","..","..","..","..","..","..","..","..","..","..","..","..","..","..",88.9,"..","..","..",null,"Somalia","Low income"]
[191,"South Africa","South Africa Rand                       ","ZAR","2021-10-01",15.146000000000001,null,"ZAF","South Africa","Full data, Source: Full data, Source: DHS-South Africa  2016","Eastern and Southern Africa","Southern Africa","Sub-Saharan Africa","Upper-Middle-Income","Full data, Source: DHS",191,"2016","South Africa",710,913,0,983.43799999999999,989.18399999999997,993.83,1000.124,1011.824,1031.211,1060.056,1095.9000000000001,1133.4359999999999,1165.58,1187.288,1192.479,1187.8440000000001,1176.2650000000001,1162.4829999999999,1150.3679999999999,1142.481,1136.136,1131.4770000000001,1128.2619999999999,1126.1610000000001,null,5798.3959999999997,5716.6049999999996,5692.2250000000004,5680.2830000000004,5602.5209999999997,5494.2749999999996,null,"South Africa",114,0.63100000000000001,0.61099999999999999,0.61899999999999999,0.61899999999999999,0.61899999999999999,0.622,0.626,0.63200000000000001,0.64600000000000002,0.65500000000000003,0.66400000000000003,0.66500000000000004,0.67500000000000004,0.68500000000000005,0.69299999999999995,0.70099999999999996,0.70299999999999996,0.70499999999999996,0.70699999999999996,0.70899999999999996,null,"South Africa",53.2,"..","..","..","..",48.4,"..","..",36.799999999999997,"..",35.6,"..","..","..",37.299999999999997,"..","..","..","..","..","..",null,"South Africa","Upper Middle Income"]
[192,"South Sudan","South Sudanese Pound                    ","SSP","2021-10-01",404.01100000000002,null,"SSD","South Sudan","South Sudan 2010","Eastern and Southern Africa","Eastern Africa","Sub-Saharan Africa","Low-Income","Full data, Source: MICS",192,"2010","South Sudan",728,910,0,240,246,250,254,260,270,283,300,317,331,341,352,358,361,360,358,358,356,354,354,357,null,1975.317,2069.9090000000001,2161.473,2240.2260000000001,2310.806,2367.5419999999999,null,"South Sudan",185,"..","..","..","..","..","..","..","..","..","..",0.41,0.43,0.39700000000000002,0.42799999999999999,0.42799999999999999,0.42499999999999999,0.42099999999999999,0.42599999999999999,0.42899999999999999,0.433,null,"South Sudan","..","..","..","..","..","..","..","..","..",67,"..","..","..","..","..","..",91.6,"..","..","..","..",null,"South Sudan","Low income"]
[193,"Spain","Euro                                    ","EUR","2021-10-01",0.86,null,"ESP",null,null,"Western Europe",null,null,"High-Income","Partial data, Source: National survey",193,null,"Spain",724,925,0,371,383,401,423,448,472,497,522,541,548,539,519,483,439,401,375,365,367,378,389,395,null,1840.739,1745.76,1731.366,1763.77,1787.11,1751.6769999999999,null,"Spain",25,0.83199999999999996,0.83499999999999996,0.83699999999999997,0.84,0.84399999999999997,0.85099999999999998,0.85599999999999998,0.86,0.86299999999999999,0.86499999999999999,0.872,0.878,0.88100000000000001,0.88200000000000001,0.88800000000000001,0.89500000000000002,0.89900000000000002,0.90300000000000002,0.90500000000000003,0.90400000000000003,null,"Spain",0.7,"..","..",1.2,1.3,1.1000000000000001,1.1000000000000001,0.7,0.9,1.1000000000000001,1.1000000000000001,1.7,1.6,1.7,1.5,1.5,1.7,1.1000000000000001,1.3,"..","..",null,"Spain","High Income"]
[194,"Sri Lanka","Sri Lanka Rupee                         ","LKR","2021-10-01",198.98,null,"LKA",null,null,"South Asia",null,null,"Lower-Middle Income","No data, regional estimates only ",194,null,"Sri Lanka",144,5501,0,331,336,344,355,365,370,372,369,365,359,355,351,348,345,343,341,340,339,338,337,333,null,1570.5170000000001,1508.85,1478.049,1438.4469999999999,1366.598,1275.068,null,"Sri Lanka",72,0.69099999999999995,0.69699999999999995,0.70299999999999996,0.71199999999999997,0.71899999999999997,0.72499999999999998,0.73199999999999998,0.73799999999999999,0.746,0.749,0.754,0.76,0.76600000000000001,0.76900000000000002,0.77300000000000002,0.77600000000000002,0.77300000000000002,0.77500000000000002,0.77900000000000003,0.78200000000000003,null,"Sri Lanka","..","..",37.799999999999997,"..","..","..",25.7,"..","..",19.899999999999999,"..","..",16.2,"..","..","..",11,"..","..","..","..",null,"Sri Lanka","Upper Middle Income"]
[195,"State of Palestine","Israel Shekel                           ","ILS",44470,3.2170000000000001,null,"PSE","State of Palestine","OPT 2019-2020","Middle East and North Africa","Western Asia","Western Asia and Northern Africa","","Full data, Source: MICS",195,"2019-2020","State of Palestine",275,922,0,116,116,115,115,115,117,120,123,128,132,135,138,140,141,142,142,140,138,136,135,135,null,735.35599999999999,753.53300000000002,774.21100000000001,790.96,802.60799999999995,808.55700000000002,null,"State of Palestine",115,"..","..","..","..",0.65100000000000002,0.65900000000000003,0.65900000000000003,0.66900000000000004,0.67400000000000004,0.67900000000000005,0.68400000000000005,0.69199999999999995,0.69799999999999995,0.69499999999999995,0.69699999999999995,0.70099999999999996,0.70399999999999996,0.70599999999999996,0.70799999999999996,0.70799999999999996,null,"State of Palestine","..","..","..","..",4.8,5,3.9,7.4,"..",2.6,3.2,3,"..","..","..","..",4.5,"..","..","..","..",null,"State of Palestine","Lower Middle Income"]
[196,"Sudan","Sudanese Pound                          ","SDG","2021-10-01",448,null,"SDN","Sudan","Sudan 2015","Eastern and Southern Africa","Northern Africa","Western Asia and Northern Africa","Low-Income","Full data, Source: MICS",196,"2015","Sudan",729,912,0,990,1008,1030,1054,1077,1095,1111,1124,1135,1146,1159,1169,1181,1195,1210,1227,1243,1261,1280,1300,1320,null,7158.1440000000002,7679.1419999999998,8142.1419999999998,8531.6509999999998,8858.7659999999996,9162.8850000000002,null,"Sudan",170,0.40300000000000002,0.40899999999999997,0.41499999999999998,0.42199999999999999,0.43,0.437,0.443,0.45,0.46100000000000002,0.46800000000000003,0.46899999999999997,0.47399999999999998,0.48599999999999999,0.49399999999999999,0.499,0.504,0.50700000000000001,0.50900000000000001,0.50600000000000001,0.51,null,"Sudan","..","..","..","..","..","..","..","..","..",42,"..","..","..","..",44,"..","..","..","..","..","..",null,"Sudan","Lower Middle Income"]
[197,"Suriname","Surinamese Dollar                       ","SRD","2021-10-01",21.2,null,"SUR","Suriname","Suriname 2018","Latin America and Caribbean","South America","Latin America and the Caribbean","Upper-Middle-Income","Full data, Source: MICS",197,"2018","Suriname",740,931,0,11,11,11,11,11,11,11,11,11,10,10,10,11,11,11,11,11,11,10,10,10,null,52.311,50.981999999999999,49.59,48.076000000000001,46.578000000000003,45.055,null,"Suriname",97,"..","..","..","..",0.68200000000000005,0.68600000000000005,0.69099999999999995,0.69699999999999995,0.70099999999999996,0.70699999999999996,0.71,0.71699999999999997,0.72899999999999998,0.73399999999999999,0.73499999999999999,0.74,0.73499999999999999,0.73199999999999998,0.73399999999999999,0.73799999999999999,null,"Suriname","..","..","..","..","..","..","..","..","..","..","..","..","..","..","..","..","..","..","..","..","..",null,"Swaziland","Lower Middle Income"]
[198,"Swaziland","Lilangeni                               ","SZL","2021-10-01",15.146000000000001,null,"SWZ","Swaziland","Swaziland 2014","Eastern and Southern Africa","Southern Africa",{"$error":"#N/A"},"Lower-Middle Income","Full data, Source: MICS",198,"2014","Swaziland",748,913,0,29,29,29,29,30,31,31,32,32,33,32,32,30,29,28,27,28,28,29,30,30,null,144.11000000000001,144.113,149.13999999999999,153.93,154.09100000000001,150.62,null,"Swaziland",138,0.46500000000000002,0.45400000000000001,0.442,0.437,0.44500000000000001,0.45600000000000002,0.46899999999999997,0.47799999999999998,0.48699999999999999,0.498,0.51,0.52400000000000002,0.53900000000000003,0.55400000000000005,0.56799999999999995,0.58099999999999996,0.58799999999999997,0.59699999999999998,0.60499999999999998,0.61099999999999999,null,"Swaziland",72,"..","..","..","..","..","..","..","..",65.099999999999994,"..","..","..","..","..","..",52.1,"..","..","..","..",null,"Suriname","Upper Middle Income"]
[199,"Sweden","Swedish Krona                           ","SEK","2021-10-01",8.7669999999999995,null,"SWE",null,null,"Western Europe",null,null,"High-Income","Partial data, Source: National survey",199,"2010","Sweden",752,924,0,71,75,84,97,109,117,120,120,117,114,111,110,110,110,111,112,114,116,119,121,122,null,600.84100000000001,583.904,571.04700000000003,581.745,601.50599999999997,613.83900000000006,null,"Sweden",7,0.90300000000000002,0.90500000000000003,0.90800000000000003,0.91300000000000003,0.90100000000000002,0.90400000000000003,0.90800000000000003,0.91,0.90700000000000003,0.90500000000000003,0.91100000000000003,0.91200000000000003,0.91400000000000003,0.93300000000000005,0.93500000000000005,0.93799999999999994,0.94,0.94199999999999995,0.94299999999999995,0.94499999999999995,null,"Sweden","..","..","..",0.4,0.5,1.2,0.5,0.5,0.7,0.6,0.7,0.8,0.5,0.8,0.6,0.8,0.5,0.3,0.9,"..","..",null,"Sweden","High Income"]
[200,"Switzerland","Swiss Franc                             ","CHF","2021-10-01",0.93100000000000005,null,"CHE",null,null,"Western Europe",null,null,"High-Income","Partial data, Source: National survey",200,"2003","Switzerland",756,926,0,75,73,72,71,71,71,72,74,76,78,80,82,83,85,86,87,88,89,90,90,90,null,443.404,436.89100000000002,428.92,427.517,436.82,452.62799999999999,null,"Switzerland",2,0.89800000000000002,0.9,0.89900000000000002,0.90500000000000003,0.90900000000000003,0.91400000000000003,0.92,0.92300000000000004,0.92500000000000004,0.93500000000000005,0.94099999999999995,0.94099999999999995,0.94399999999999995,0.94599999999999995,0.94199999999999995,0.94699999999999995,0.94699999999999995,0.94899999999999995,0.95499999999999996,0.95499999999999996,null,"Switzerland",0.2,"..","..","..","..","..",0.1,0.1,0.1,0.1,0.1,"..","..","..","..","..",0.1,"..","..","..","..",null,"Switzerland","High Income"]
[201,"Syrian Arab Republic","Syrian Pound                            ","SYP","2021-10-01",2500,null,"SYR","Syrian Arab Republic","Syria 2005","Middle East and North Africa","Western Asia","Western Asia and Northern Africa","Low-Income","Full data, Source: MICS",201,"2005","Syrian Arab Republic",760,922,0,528,528,519,508,505,516,543,585,627,647,634,610,555,486,426,389,365,363,377,401,426,null,2158.3789999999999,2269.5059999999999,2233.701,2278.94,2361.67,2392.6469999999999,null,"Syrian Arab Republic",151,0.6,0.60699999999999998,0.60699999999999998,0.62,0.63600000000000001,0.65200000000000002,0.66200000000000003,0.67300000000000004,0.67600000000000005,0.67400000000000004,0.67200000000000004,0.67800000000000005,0.66400000000000003,0.59599999999999997,0.55600000000000005,0.53700000000000003,0.52800000000000002,0.56399999999999995,0.56299999999999994,0.56699999999999995,null,"Syrian Arab Republic","..","..","..",10.199999999999999,"..","..","..","..","..","..","..","..","..","..","..","..","..","..","..","..","..",null,"Syrian Arab Republic","Low income"]
[202,"Tajikistan","Tajikistan Somoni                       ","TJS","2021-10-01",11.263999999999999,null,"TJK","Tajikistan","Full data, Source: Full data, Source: DHS-Tajikistan 2017","Eastern Europe and Central Asia","Central Asia","Central Asia and Southern Asia","Lower-Middle Income","Full data, Source: DHS",202,"2017","Tajikistan",762,5500,0,183,181,178,176,175,178,184,194,205,217,229,238,247,255,261,266,270,272,273,273,271,null,1356.3820000000001,1349.018,1477.7670000000001,1640.3630000000001,1701.6479999999999,1670.1010000000001,null,"Tajikistan",125,0.55500000000000005,0.56399999999999995,0.57299999999999995,0.58799999999999997,0.6,0.60699999999999998,0.61699999999999999,0.621,0.63900000000000001,0.63300000000000001,0.63800000000000001,0.63600000000000001,0.64300000000000002,0.65300000000000002,0.65200000000000002,0.65200000000000002,0.65300000000000002,0.65700000000000003,0.66100000000000003,0.66800000000000004,null,"Tajikistan","..","..","..",63.3,45.1,"..","..",31.1,"..",22.4,"..","..","..","..","..",17.8,"..","..","..","..","..",null,"Tajikistan","Low income"]
[203,"Thailand","Thai Baht                               ","THB","2021-10-01",33.880000000000003,null,"THA","Thailand","Thai 2019","Southeastern Asia","South-Eastern Asia","Eastern Asia and South-eastern Asia","Upper-Middle-Income","Full data, Source: MICS",203,"2019","Thailand",764,920,0,891,871,855,842,832,824,821,821,822,820,815,804,789,772,755,741,731,724,718,711,701,null,3339.41,3118.1579999999999,2961.634,2841.569,2715.0909999999999,2597.3969999999999,null,"Thailand",79,0.65200000000000002,0.66,0.66900000000000004,0.67700000000000005,0.68600000000000005,0.69599999999999995,0.69699999999999995,0.71399999999999997,0.71799999999999997,0.72199999999999998,0.72399999999999998,0.73299999999999998,0.73699999999999999,0.73399999999999999,0.74199999999999999,0.749,0.75600000000000001,0.76500000000000001,0.77200000000000002,0.77700000000000002,null,"Thailand",18.3,"..",11.8,"..",8.6999999999999993,"..",6.1,4.3,3.4,2.9,2.4,1.3,1.4,1.1000000000000001,0.9,0.5,0.6,0.4,0.5,0.3,"..",null,"Thailand","Upper Middle Income"]
[204,"Timor-Leste","US Dollar                               ","USD","2021-10-01",1,null,"TLS","Timor-Leste","Timor Leste 2016","Southeastern Asia","South-Eastern Asia","Eastern Asia and South-eastern Asia","Lower-Middle Income","Full data, Source: MICS",204,"2016","Timor-Leste",626,920,0,31,31,33,34,35,36,35,34,33,31,30,30,30,31,31,33,34,36,37,39,40,null,193.00399999999999,194.54400000000001,191.17599999999999,186.21299999999999,183.572,184.529,null,"Timor-Leste",141,0.48399999999999999,0.49199999999999999,0.503,0.504,0.51800000000000002,0.53700000000000003,0.56299999999999994,0.58499999999999996,0.61599999999999999,0.61099999999999999,0.628,0.64400000000000002,0.63900000000000001,0.63,0.62,0.61,0.59799999999999998,0.59899999999999998,0.59899999999999998,0.60599999999999998,null,"Timor-Leste","..",69.900000000000006,"..","..","..","..","..",77.3,"..","..","..","..","..","..",65.900000000000006,"..","..","..","..","..","..",null,"Timor-Leste","Lower Middle Income"]
[205,"Togo","CFA Franc                               ","XOF","2021-10-01",563.97299999999996,null,"TGO","Togo","Togo 2010","West and Central Africa","Western Africa","Sub-Saharan Africa","Low-Income","Full data, Source: MICS",205,"2010","Togo",768,914,0,180,186,191,196,200,205,209,213,217,221,224,227,229,231,234,236,239,243,246,250,254,null,1386.6510000000001,1490.8430000000001,1591.13,1678.521,1752.1590000000001,1818.6079999999999,null,"Togo",167,0.42699999999999999,0.43,0.433,0.438,0.439,0.438,0.44400000000000001,0.439,0.44700000000000001,0.45600000000000002,0.46600000000000003,0.47899999999999998,0.48199999999999998,0.48799999999999999,0.49299999999999999,0.499,0.502,0.50600000000000001,0.51,0.51500000000000001,null,"Togo","..","..","..","..","..","..",78.3,"..","..","..","..",75.900000000000006,"..","..","..",74.2,"..","..","..","..","..",null,"Togo","Low income"]
[206,"Tokealau","New Zealand Dollar                      ","NZD","2021-10-01",1.452,null,"TKL",null,null,"Oceania",null,null,"","No data",206,null,"Tokealau",null,null,null,null,null,null,null,null,null,null,null,null,null,null,null,null,null,null,null,null,null,null,null,null,null,null,null,null,null,null,null,null,"Tokealau",null,null,null,null,null,null,null,null,null,null,null,null,null,null,null,null,null,null,null,null,null,null,"Tokealau",null,null,null,null,null,null,null,null,null,null,null,null,null,null,null,null,null,null,null,null,null,null,"Tokealau"]
[207,"Tonga","Tonga Pa'anga                           ","TOP","2021-10-01",2.1920000000000002,null,"TON","Tonga","Tonga 2019","Oceania","Oceania","Oceania excluding Australia and New Zealand","Upper-Middle-Income","Full data, Source: MICS",207,"2019","Tonga",776,957,0,2,2,3,3,3,3,3,3,3,3,3,3,3,3,3,3,3,2,2,2,2,null,12.582000000000001,12.891,13.215,13.272,13.081,12.715999999999999,null,"Tonga",104,0.67500000000000004,0.67900000000000005,0.68400000000000005,0.69299999999999995,0.68200000000000005,0.68200000000000005,0.68300000000000005,0.68600000000000005,0.68799999999999994,0.69299999999999995,0.69899999999999995,0.70399999999999996,0.70799999999999996,0.70799999999999996,0.70699999999999996,0.72,0.72199999999999998,0.72299999999999998,0.72299999999999998,0.72499999999999998,null,"Tonga",7.9,"..","..","..","..","..","..","..","..",8.9,"..","..","..","..","..",7.5,"..","..","..","..","..",null,"Tonga"]
[208,"Trinidad and Tobago","Trinidad and Tobago Dollar              ","TTD","2021-10-01",6.7610000000000001,null,"TTO","Trinidad and Tobago","Trinidad & Tobago 2011","Latin America and Caribbean","Caribbean","Latin America and the Caribbean","High-Income","Full data, Source: MICS",208,"2011","Trinidad and Tobago",780,915,0,18,18,18,19,19,20,20,20,20,20,20,20,19,19,19,19,18,18,18,17,17,null,80.685000000000002,74.599999999999994,72.811000000000007,72.33,70.224000000000004,66.106999999999999,null,"Trinidad and Tobago",67,0.71699999999999997,0.72499999999999998,0.72599999999999998,0.74,0.75,0.748,0.76300000000000001,0.77100000000000002,0.77800000000000002,0.78200000000000003,0.78400000000000003,0.78200000000000003,0.78,0.78300000000000003,0.78500000000000003,0.79200000000000004,0.79200000000000004,0.79500000000000004,0.79500000000000004,0.79600000000000004,null,"Trinidad and Tobago","..","..","..","..","..","..","..","..","..","..","..","..","..","..","..","..","..","..","..","..","..",null,"Trinidad and Tobago","High Income"]
[209,"Tunisia","Tunisian Dinar                          ","TND","2021-10-01",2.8109999999999999,null,"TUN","Tunisia","Tunisia 2018","Middle East and North Africa","Northern Africa","Western Asia and Northern Africa","Lower-Middle Income","Full data, Source: MICS",209,"2018","Tunisia",788,912,0,165,164,163,162,162,163,165,168,172,177,183,192,202,211,218,220,217,210,200,190,183,null,928.98699999999997,840.44299999999998,796.93499999999995,803.95600000000002,828.51900000000001,832.01300000000003,null,"Tunisia",95,0.65100000000000002,0.65900000000000003,0.66400000000000003,0.67100000000000004,0.68100000000000005,0.68799999999999994,0.69399999999999995,0.7,0.70699999999999996,0.70899999999999996,0.71599999999999997,0.71799999999999997,0.72,0.72299999999999998,0.72599999999999998,0.72899999999999998,0.73099999999999998,0.73399999999999999,0.73799999999999999,0.74,null,"Tunisia",22.9,"..","..","..","..",15.2,"..","..","..","..",9.1999999999999993,"..","..","..","..",3,"..","..","..","..","..",null,"Tunisia","Lower Middle Income"]
[210,"Turkey","Turkish Lira                            ","TRY","2021-10-01",8.8699999999999992,null,"TUR","Turkey","Full data, Source: Full data, Source: DHS-TR 2013","Eastern Europe and Central Asia","Western Asia","Western Asia and Northern Africa","Upper-Middle-Income","Full data, Source: DHS",210,"2013","Turkey",792,922,0,1379,1366,1342,1312,1284,1264,1255,1253,1259,1272,1290,1310,1336,1361,1379,1383,1372,1348,1316,1284,1257,null,6368.8090000000002,6091.027,5866.741,5682.665,5511.42,5357.7669999999998,null,"Turkey",54,0.66,0.66600000000000004,0.67700000000000005,0.68400000000000005,0.69,0.69599999999999995,0.70399999999999996,0.71199999999999997,0.71399999999999997,0.72,0.73899999999999999,0.753,0.76500000000000001,0.78500000000000003,0.79600000000000004,0.80100000000000005,0.80800000000000005,0.81399999999999995,0.81699999999999995,0.82,null,"Turkey","..","..",12,14.5,9.6999999999999993,9.4,7.9,6.4,5.5,4.5999999999999996,4.3,4,3.1,2.7,2.1,2.4,1.6,1.5,1.4,2.2000000000000002,"..",null,"Turkey","Upper Middle Income"]
[211,"Turkmenistan","Turkmenistan Manat                      ","TMT","2021-10-01",3.5,null,"TKM","Turkmenistan","Turk 2019","Eastern Europe and Central Asia","Central Asia","Central Asia and Southern Asia","Upper-Middle-Income","Full data, Source: MICS",211,"2019","Turkmenistan",795,5500,0,84,88,94,103,111,116,115,112,108,106,109,117,129,142,152,156,153,144,133,122,115,null,647.66700000000003,607.98800000000006,608.80499999999995,635.16399999999999,650.87800000000004,635.61199999999997,null,"Turkmenistan",111,"..","..","..","..","..","..","..","..","..","..",0.66600000000000004,0.67300000000000004,0.67900000000000005,0.68500000000000005,0.68899999999999995,0.69399999999999995,0.69899999999999995,0.70099999999999996,0.71,0.71499999999999997,null,"Turkmenistan","..","..","..","..","..","..","..","..","..","..","..","..","..","..","..","..","..","..","..","..","..",null,"Turkmenistan"]
[212,"Turks and Caicos Island","US Dollar                               ","USD","2021-10-01",1,null,"TCA","Turks and Caicos Islands","Full data, Source: MICS-Turks and Caicos Islands 2019-2020 (very small sample)","Latin America and Caribbean","Carribean",{"$error":"#N/A"},"High-Income","Full data, Source: MICS",212,"2019-20","Turks and Caicos Island",null,null,null,null,null,null,null,null,null,null,null,null,null,null,null,null,null,null,null,null,null,null,null,null,null,null,null,null,null,null,null,null,"Turks and Caicos Island",null,null,null,null,null,null,null,null,null,null,null,null,null,null,null,null,null,null,null,null,null,null,"Turks and Caicos Island",null,null,null,null,null,null,null,null,null,null,null,null,null,null,null,null,null,null,null,null,null,null,"Turks and Caicos Island"]
[213,"Tuvalu","Australian Dollar                       ","AUD","2021-10-01",1.39,null,"TUV","Tuvalu","Full data, Source: MICS-Tuvalo 2019","Oceania","Oceania","Oceania excluding Australia and New Zealand","Upper-Middle-Income","Full data, Source: MICS",213,"2019","Tuvalu",null,null,null,null,null,null,null,null,null,null,null,null,null,null,null,null,null,null,null,null,null,0.25700000000000001,0.251,0.309,null,null,null,null,null,null,null,null,"Tuvalu",null,null,null,null,null,null,null,null,null,null,null,null,null,null,null,null,null,null,null,null,null,null,"Tuvalu","..","..","..","..","..","..","..","..","..","..",17.600000000000001,"..","..","..","..","..","..","..","..","..","..",null,"Tuvalu"]
[214,"Uganda","Uganda Shilling                         ","UGX","2021-10-01",3533.24,null,"UGA","Uganda","Full data, Source: Full data, Source: DHS-Uganda 2016","Eastern and Southern Africa","Eastern Africa","Sub-Saharan Africa","Low-Income","Full data, Source: DHS",214,"2016","Uganda",800,910,0,1028,1057,1089,1123,1157,1190,1220,1250,1280,1309,1339,1364,1389,1416,1444,1476,1505,1536,1567,1592,1610,null,8611.0769999999993,8989.5859999999993,9299.5720000000001,9501.0519999999997,9670.9889999999996,9770.4989999999998,null,"Uganda",159,0.40400000000000003,0.41199999999999998,0.42699999999999999,0.436,0.436,0.44400000000000001,0.45600000000000002,0.46600000000000003,0.47899999999999998,0.48699999999999999,0.498,0.504,0.50700000000000001,0.51300000000000001,0.51900000000000002,0.52500000000000002,0.52900000000000003,0.53200000000000003,0.53800000000000003,0.54400000000000004,null,"Uganda","..","..",85.2,"..","..",80.2,"..","..","..",73.5,"..","..",67.3,"..","..","..",69.599999999999994,"..","..","..","..",null,"Uganda","Low income"]
[215,"Ukraine","Ukraine Hryvnia                         ","UAH","2021-10-01",26.61,null,"UKR","Ukraine","Ukraine 2012","Eastern Europe and Central Asia","Eastern Europe","Northern America and Europe","Lower-Middle Income","Full data, Source: MICS",215,"2012","Ukraine",804,923,0,409,400,394,391,396,410,435,467,502,529,544,542,527,503,477,452,430,410,393,380,370,null,1854.5129999999999,1712.0229999999999,1684.79,1697.7570000000001,1688.5519999999999,1626.4670000000001,null,"Ukraine",74,0.69399999999999995,0.70799999999999996,0.71699999999999997,0.72499999999999998,0.73199999999999998,0.73799999999999999,0.74399999999999999,0.751,0.755,0.749,0.755,0.76,0.76400000000000001,0.76700000000000002,0.77100000000000002,0.76500000000000001,0.76800000000000002,0.77100000000000002,0.77400000000000002,0.77900000000000003,null,"Ukraine","..","..",10.3,6,4.8,2.2000000000000002,1.4,0.9,0.3,0.5,0.2,0.2,0.2,0.1,0.1,0.5,0.4,0.3,0.4,0.2,"..",null,"Ukraine","Lower Middle Income"]
[216,"United Arab Emirates","United Arab Emirates Dirham             ","AED","2021-10-01",3.673,null,"ARE",null,null,"Middle East and North Africa",null,null,"High-Income","No data, regional estimates only ",216,null,"United Arab Emirates",784,922,0,50,50,50,52,57,64,70,79,89,96,100,105,107,106,103,101,99,97,95,93,93,null,501.78500000000003,489.68299999999999,482.26299999999998,489.36,515.28599999999994,542.49900000000002,null,"United Arab Emirates",31,0.78200000000000003,0.78700000000000003,0.79200000000000004,0.79800000000000004,0.80300000000000005,0.80900000000000005,0.81399999999999995,0.81899999999999995,0.82099999999999995,0.81899999999999995,0.82,0.82599999999999996,0.83199999999999996,0.83799999999999997,0.84699999999999998,0.85899999999999999,0.86399999999999999,0.88100000000000001,0.88900000000000001,0.89,null,"United Arab Emirates","..","..","..","..","..","..","..","..","..","..","..","..","..","..","..","..","..","..","..","..","..",null,"United Arab Emirates","High Income"]
[217,"United Kingdom","U.K. Pound                              ","GBP","2021-10-01",0.74399999999999999,null,"GBR",null,null,"Western Europe",null,null,"High-Income","Partial data, Source: National survey",217,"2011","United Kingdom",826,924,0,681,675,672,674,683,702,729,764,801,832,849,854,845,828,807,789,774,761,750,744,744,null,3863.4090000000001,3768.547,3698.06,3734.5439999999999,3813.4780000000001,3832.16,null,"United Kingdom",13,0.874,0.878,0.88100000000000001,0.88500000000000001,0.89200000000000002,0.89700000000000002,0.89600000000000002,0.89900000000000002,0.90300000000000002,0.90600000000000003,0.91200000000000003,0.90600000000000003,0.90400000000000003,0.92100000000000004,0.92500000000000004,0.92300000000000004,0.92400000000000004,0.92600000000000005,0.92800000000000005,0.93200000000000005,null,"United Kingdom",0.5,0.5,0.5,0.5,0.6,0.8,0.4,0.5,0.5,0.3,0.3,0.5,0.2,0.2,0.3,0.3,0.3,0.5,"..","..","..",null,"United Kingdom","High Income"]
[218,"United Republic of Tanzania","Tanzania Shilling                       ","TZS","2021-10-01",2300,null,"TZA","United Republic of Tanzania","Full data, Source: Full data, Source: DHS-Tanzania  2015-2016","Eastern and Southern Africa","Eastern Africa","Sub-Saharan Africa","Lower-Middle Income","Full data, Source: DHS",218,"2015-16","United Republic of Tanzania",834,910,0,1221,1268,1327,1393,1457,1513,1556,1592,1623,1651,1679,1703,1727,1753,1783,1819,1860,1907,1958,2008,2057,null,11305.514999999999,12461.257,13645.326999999999,14765.657999999999,15858.735000000001,16943.618999999999,null,"United Republic of Tanzania",163,0.39,0.39700000000000002,0.40699999999999997,0.41599999999999998,0.42599999999999999,0.437,0.44700000000000001,0.45600000000000002,0.46500000000000002,0.47399999999999998,0.48099999999999998,0.48699999999999999,0.496,0.497,0.504,0.51400000000000001,0.52,0.52300000000000002,0.52400000000000002,0.52900000000000003,null,"United Republic of Tanzania",96.3,"..","..","..","..","..","..",83.8,"..","..","..",79.5,"..","..","..","..","..",76.8,"..","..","..",null,"United Republic of Tanzania","Low income"]
[219,"United States of America","US Dollar                               ","USD","2021-10-01",1,null,"USA",null,null,"North America",null,null,"High-Income","Partial data, Source: National survey",219,"2018","United States of America",840,918,0,3718,3803,3939,4100,4245,4344,4385,4383,4344,4280,4200,4107,4001,3896,3812,3763,3764,3802,3864,3932,3991,null,20180.170999999998,20617.073,20670.268,20631.085999999999,20538.555,20541.388999999999,null,"United States of America",17,0.88600000000000001,0.88900000000000001,0.89100000000000001,0.89400000000000002,0.89700000000000002,0.9,0.90300000000000002,0.90600000000000003,0.91100000000000003,0.91200000000000003,0.91600000000000004,0.91900000000000004,0.92,0.91800000000000004,0.92,0.92100000000000004,0.92200000000000004,0.92400000000000004,0.92500000000000004,0.92600000000000005,null,"United States of America",0.7,1,1,1.2,1.2,1.2,1.2,1.2,1.2,1,1.2,1.2,1.2,1.2,1.5,1.2,1.2,1.5,1.2,"..","..",null,"United States of America","High Income"]
[220,"United States Virgin Islands","US Dollar                               ","USD","2021-10-01",1,null,"VIR",null,null,"Latin America and Caribbean",null,null,"High-Income","No data, regional estimates only ",220,null,"United States Virgin Islands",850,915,0,1,1,1,1,1,2,2,2,2,2,2,2,1,1,1,1,1,1,1,1,1,null,5.7830000000000004,5.5250000000000004,5.39,5.0819999999999999,4.6680000000000001,4.2910000000000004,null,"United States Virgin Islands",null,null,null,null,null,null,null,null,null,null,null,null,null,null,null,null,null,null,null,null,null,null,"United States Virgin Islands","..","..","..","..","..","..","..","..","..","..","..","..","..","..","..","..","..","..","..","..","..",null,"United States Virgin Islands"]
[221,"Uruguay","Uruguay Peso                            ","UYU","2021-10-01",42.667000000000002,null,"URY",null,null,"Latin America and Caribbean",null,null,"High-Income","Partial data, Source: National survey ",221,"2011","Uruguay",858,931,0,52,51,51,51,51,50,49,48,47,47,46,47,47,48,49,49,49,49,48,47,47,null,232.29300000000001,225.02,216.417,208.31299999999999,201.93199999999999,196.67500000000001,null,"Uruguay",55,0.74299999999999999,0.747,0.749,0.752,0.755,0.75800000000000001,0.76300000000000001,0.76500000000000001,0.76900000000000002,0.77500000000000002,0.78200000000000003,0.78900000000000003,0.79300000000000004,0.8,0.80300000000000005,0.80600000000000005,0.81,0.81399999999999995,0.81599999999999995,0.81699999999999995,null,"Uruguay",2.1,2.5,3.3,4.4000000000000004,5.8,4.7,3.7,3,1.8,1.8,1.3,1,1.1000000000000001,0.9,0.7,0.7,0.6,0.4,0.4,0.5,"..",null,"Uruguay","High Income"]
[222,"Uzbekistan","Uzbekistan Sum                          ","UZS","2021-10-01",10650,null,"UZB","Uzbekistan","Uzbekistan 2000","Eastern Europe and Central Asia","Central Asia","Central Asia and Southern Asia","Lower-Middle Income","Full data, Source: MICS",222,"2000","Uzbekistan",860,5500,0,510,499,494,496,506,524,550,582,617,648,670,679,679,673,667,665,669,677,685,688,683,null,3208.5219999999999,2991.482,3010.2840000000001,3104.2689999999998,3080.7840000000001,2927.6060000000002,null,"Uzbekistan",106,0.59899999999999998,0.60699999999999998,0.61399999999999999,0.61899999999999999,0.626,0.63300000000000001,0.63700000000000001,0.64900000000000002,0.65300000000000002,0.66,0.66900000000000004,0.67600000000000005,0.68500000000000005,0.69199999999999995,0.69599999999999995,0.70099999999999996,0.70499999999999996,0.71299999999999997,0.71699999999999997,0.72,null,"Uzbekistan",86.5,"..",85.6,86.2,"..","..","..","..","..","..","..","..","..","..","..","..","..","..","..","..","..",null,"Uzbekistan","Lower Middle Income"]
[223,"Vanuatu","Vanuatu Vatu                            ","VUV","2021-10-01",108.57,null,"VUT",null,null,"Oceania",null,null,"Lower-Middle Income","No data, regional estimates only ",223,null,"Vanuatu",548,928,0,6,6,6,6,6,6,6,7,7,7,8,8,8,7,7,7,8,8,8,9,9,null,45.256,47.878999999999998,51.043999999999997,54.216000000000001,56.996000000000002,59.484000000000002,null,"Vanuatu",140,"..","..","..","..","..",0.57399999999999995,0.57999999999999996,0.58299999999999996,0.58899999999999997,0.58899999999999997,0.59,0.59099999999999997,0.59099999999999997,0.59299999999999997,0.59399999999999997,0.59799999999999998,0.59799999999999998,0.60099999999999998,0.60299999999999998,0.60899999999999999,null,"Vanuatu","..","..","..","..","..","..","..","..","..","..",39.4,"..","..","..","..","..","..","..","..","..","..",null,"Vanuatu","Lower Middle Income"]
[224,"Vatican","Euro                                    ","EUR","2021-10-01",1.1561999999999999,null,"VAT",null,null,"Western Europe",null,null,"","No data",224,null,"Vatican",null,null,null,null,null,null,null,null,null,null,null,null,null,null,null,null,null,null,null,null,null,null,null,null,null,null,null,null,null,null,null,null,"Vatican",null,null,null,null,null,null,null,null,null,null,null,null,null,null,null,null,null,null,null,null,null,null,"Vatican",null,null,null,null,null,null,null,null,null,null,null,null,null,null,null,null,null,null,null,null,null,null,"Vatican"]
[225,"Venezuela (Bolivarian Republic of)","Bolivar Digital                         ","VES","2021-10-01",4.1040000000000001,null,"VEN",null,null,"Latin America and Caribbean",null,null,"","No data, regional estimates only ",225,null,"Venezuela (Bolivarian Republic of)",862,931,0,567,572,575,578,579,580,581,580,579,579,580,586,595,600,594,573,543,499,452,419,410,null,2518.0909999999999,2681.9290000000001,2653.7759999999998,2517.1680000000001,2385.875,2302.1990000000001,null,"Venezuela (Bolivarian Republic of)",113,0.67600000000000005,0.68400000000000005,0.69199999999999995,0.69199999999999995,0.70399999999999996,0.71799999999999997,0.73099999999999998,0.748,0.75700000000000001,0.75600000000000001,0.75700000000000001,0.76900000000000002,0.77200000000000002,0.77700000000000002,0.77500000000000002,0.76900000000000002,0.75900000000000001,0.74299999999999999,0.73299999999999998,0.71099999999999997,null,"Venezuela (Bolivarian Republic of)","..",22.1,30.9,36.4,30.7,24.4,14.3,"..","..","..","..","..","..","..","..","..","..","..","..","..","..",null,"Venezuela (Bolivarian Republic of)","Upper Middle Income"]
[226,"Viet Nam","Viet Nam Dong                           ","VND","2021-10-01",22735,null,"VNM","Viet Nam","Viet 2013_14","Southeastern Asia","South-Eastern Asia","Eastern Asia and South-eastern Asia","Lower-Middle Income","Full data, Source: MICS",226,"2013-14","Viet Nam",704,920,0,1150,1155,1219,1317,1416,1490,1527,1540,1536,1527,1520,1517,1514,1514,1517,1525,1543,1567,1589,1599,1592,null,7511.7209999999995,7092.3270000000002,6487.1819999999998,6311.1540000000005,6413.924,6484.1490000000003,null,"Viet Nam",117,0.58599999999999997,0.59399999999999997,0.60199999999999998,0.61099999999999999,0.62,0.624,0.63200000000000001,0.64,0.64700000000000002,0.65900000000000003,0.66100000000000003,0.67100000000000004,0.67600000000000005,0.68100000000000005,0.68300000000000005,0.68799999999999994,0.69299999999999995,0.69599999999999995,0.7,0.70399999999999996,null,"Viet Nam","..","..",70.099999999999994,"..",59.3,"..",50.6,"..",45.9,"..",16.8,"..",13,"..",11,"..",7.8,"..",6.6,"..","..",null,"Viet Nam","Lower Middle Income"]
[227,"Wallis and Futuna","CFP Franc                               ","XPF","2021-10-01",102.598,null,"WLF",null,null,null,null,null,"","No data",227,null,"Wallis and Futuna",null,null,null,null,null,null,null,null,null,null,null,null,null,null,null,null,null,null,null,null,null,null,null,null,null,null,null,null,null,null,null,null,"Wallis and Futuna",null,null,null,null,null,null,null,null,null,null,null,null,null,null,null,null,null,null,null,null,null,null,"Wallis and Futuna",null,null,null,null,null,null,null,null,null,null,null,null,null,null,null,null,null,null,null,null,null,null,"Wallis and Futuna"]
[228,"Western Sahara","Moroccan Dirham","MAD","2021-10-01",0.109,null,"ESH",null,null,"Middle East and North Africa",null,null,"","No data",228,null,"Western Sahara",null,null,null,null,null,null,null,null,null,null,null,null,null,null,null,null,null,null,null,null,null,null,null,null,null,58.884999999999998,59.792999999999999,60.469000000000001,61.622999999999998,63.054000000000002,64.448999999999998,null,"Western Sahara",null,null,null,null,null,null,null,null,null,null,null,null,null,null,null,null,null,null,null,null,null,null,"Western Sahara","..","..","..","..","..","..","..","..","..","..","..","..","..","..","..","..","..","..","..","..","..",null,"Western Sahara"]
[229,"Yemen","Yemeni Rial                             ","YER","2021-10-01",582,null,"YEM","Yemen","Full data, Source: Full data, Source: DHS-Yemen  2013","Middle East and North Africa","Western Asia","Western Asia and Northern Africa","Low-Income","Full data, Source: DHS",229,"2013","Yemen",887,922,0,603,615,636,663,690,711,724,732,738,745,754,768,785,802,816,826,830,830,827,824,824,null,4397.8450000000003,4409.6629999999996,4404.2610000000004,4358.3389999999999,4289.9489999999996,4173.6559999999999,null,"Yemen",179,0.44400000000000001,0.45300000000000001,0.46100000000000002,0.47,0.47699999999999998,0.48299999999999998,0.48799999999999999,0.49199999999999999,0.495,0.502,0.50600000000000001,0.50600000000000001,0.504,0.50900000000000001,0.502,0.48299999999999998,0.47399999999999998,0.46700000000000003,0.46800000000000003,0.47,null,"Yemen","..","..","..","..","..",37.700000000000003,"..","..","..","..","..","..","..","..",51.2,"..","..","..","..","..","..",null,"Yemen","Low income"]
[230,"Zambia","Zambia Kwacha                           ","ZMW","2021-10-01",16.73,null,"ZMB","Zambia","Full data, Source: Full data, Source: DHS-Zambia 2018-2019","Eastern and Southern Africa","Eastern Africa","Sub-Saharan Africa","Lower-Middle Income","Full data, Source: DHS",230,"2018-2019","Zambia",894,910,0,420,433,447,460,472,483,490,497,502,510,519,529,542,556,568,578,583,586,588,593,603,null,3454.299,3803.7280000000001,4129.9440000000004,4421.4920000000002,4703.4780000000001,4970.3159999999998,null,"Zambia",146,0.42499999999999999,0.432,0.441,0.45100000000000001,0.46,0.47099999999999997,0.48199999999999998,0.48799999999999999,0.503,0.51700000000000002,0.52700000000000002,0.53400000000000003,0.54900000000000004,0.55700000000000005,0.56100000000000005,0.56899999999999995,0.57099999999999995,0.57799999999999996,0.58199999999999996,0.58399999999999996,null,"Zambia","..","..",78.099999999999994,"..",76.5,"..",78.900000000000006,"..","..","..",80.8,"..","..","..","..",75.400000000000006,"..","..","..","..","..",null,"Zambia","Lower Middle Income"]
[231,"Zimbabwe","Zimbabwe RTGS dollar                    ","ZWL","2021-10-01",84.5,null,"ZWE","Zimbabwe","Zimbabwe 2018-2019","Eastern and Southern Africa","Eastern Africa","Sub-Saharan Africa","Lower-Middle Income","Full data, Source: MICS",231,"2018-19","Zimbabwe",716,910,0,354,358,361,365,370,377,386,397,409,423,438,450,464,475,481,477,461,437,411,389,377,null,2144.0529999999999,2201.9960000000001,2321.0819999999999,2407.0549999999998,2414.5529999999999,2363.15,null,"Zimbabwe",150,0.43,0.43099999999999999,0.42299999999999999,0.41399999999999998,0.41099999999999998,0.41099999999999998,0.41399999999999998,0.42099999999999999,0.42199999999999999,0.45800000000000002,0.48199999999999998,0.499,0.52500000000000002,0.53700000000000003,0.54700000000000004,0.55300000000000005,0.55800000000000005,0.56299999999999994,0.56899999999999995,0.57099999999999995,null,"Zimbabwe","..","..","..","..","..","..","..","..","..","..","..",47.2,"..","..","..","..","..",61,"..",63.8,"..",null,"Zimbabwe","Lower Middle Income"]

{"sheet":"Database 2","index":23,"n_rows":232,"n_cols":75,"rows_kept":232,"cut":false,"hidden":true,"merged":[]}
[null,"Country","ISO","Country ( to delete)","Country","UNICEF REGIONS 1","UN REGIONS","SDG regions","WORLD BANK INCOME GROUPS","Short Source","Full Source","YEAR","Country",0,1,2,3,4,5,6,7,8,9,10,11,12,13,14,15,16,17,18,19,20,21,22,23,24,25,26,27,28,29,30,31,32,33,34,35,36]
[1]
[2,"Afghanistan","AFG","Afghanistan","Afghan 2010_11","SA","Southern Asia","Central Asia and Southern Asia","LOW-INCOME","Full data, Source: MICS",null,"2010-11","Afghanistan",0.96226415094339623,0.97382198952879584,0.97,0.96954314720812185,0.94979079497907948,0.96399999999999997,0.97826086956521741,0.93675889328063244,0.95901639344262291,0.92,0.93877551020408168,0.8783783783783784,0.8801652892561983,0.86734693877551017,0.9073359073359073,0.875,0.80816326530612248,0.8418604651162791,0.80321285140562249,0.78604651162790695,0.72689075630252098,0.67910447761194026,0.75,0.54320987654320985,0.46153846153846156,0.39549839228295819,0.30196078431372547,0.30363036303630364,0.28378378378378377,0.24344569288389514,0.29090909090909089,0.30523255813953487,0.26881720430107525,0.32579185520361992,0.3247863247863248,0.19780219780219779,6.5134099616858232E-2,2.6845637583892617E-2,4.5454545454545456E-2,5.4744525547445258E-2,6.1889250814332247E-2,4.0752351097178681E-2,3.021978021978022E-2,4.6575342465753428E-2,3.1545741324921134E-2,5.1162790697674418E-2,2.2222222222222223E-2,1.8518518518518517E-2,1.8050541516245487E-2,3.3222591362126247E-3,1.1363636363636364E-2,3.8596491228070177E-2,1.9672131147540985E-2,2.1874999999999999E-2,1.7094017094017096E-2,1.0025062656641603E-2,1.3114754098360656E-2,1.3636363636363636E-2,5.4054054054054057E-3,4.3478260869565216E-2]
[3,"Albania","ALB","Albania","DHS-Albania 2017-2018","EECA","Southern Europe","Northern America and Europe","UPPER-MIDDLE-INCOME","Full data, Source: DHS",null,"2017-18","Albania",0.8666666666666667,0.89743589743589747,0.78181818181818186,0.83050847457627119,0.85365853658536583,0.88235294117647056,0.77500000000000002,0.79411764705882348,0.77142857142857146,0.73684210526315785,0.71153846153846156,0.78846153846153844,0.6428571428571429,0.57692307692307687,0.64444444444444449,0.63829787234042556,0.375,0.51219512195121952,0.33333333333333331,0.25641025641025639,0.43396226415094341,0.35294117647058826,0.36734693877551022,0.28888888888888886,0.16071428571428573,0.30909090909090908,0.14545454545454545,0.1702127659574468,0.20408163265306123,0.27500000000000002,0.16279069767441862,0.20408163265306123,0.16216216216216217,0.14583333333333334,8.8235294117647065E-2,5.7142857142857141E-2,0.16,0.13725490196078433,0.24074074074074073,0.13043478260869565,0.18,0.16666666666666666,0.19047619047619047,0.17948717948717949,8.5106382978723402E-2,0.27027027027027029,0.19047619047619047,0.12195121951219512,0.10638297872340426,0.25641025641025639,0.17073170731707318,5.3571428571428568E-2,0.10638297872340426,8.3333333333333329E-2,0.125,0.23255813953488372,0.30232558139534882,0.3,8.5106382978723402E-2,0.14634146341463414,0.3509687034277198]
[4,"Algeria","DZA","Algeria","Algeria 2018-2019","MENA","Northern Africa","Western Asia and Northern Africa","LOWER-MIDDLE INCOME","Full data, Source: MICS",null,"2018-19","Algeria",0.99411764705882355,0.93939393939393945,0.9,0.84513274336283184,0.82758620689655171,0.81589958158995812,0.76056338028169013,0.72811059907834097,0.72888888888888892,0.67630057803468213,0.72872340425531912,0.68229166666666663,0.68224299065420557,0.59473684210526312,0.59487179487179487,0.57798165137614677,0.48497854077253216,0.47549019607843135,0.36363636363636365,0.40776699029126212,0.42592592592592593,0.28272251308900526,0.31724137931034485,0.27014218009478674,0.25862068965517243,0.13461538461538461,9.375E-2,6.3157894736842107E-2,4.5454545454545456E-2,8.9005235602094238E-2,6.0913705583756347E-2,3.6036036036036036E-2,4.712041884816754E-2,6.6265060240963861E-2,1.7857142857142856E-2,8.2278481012658222E-2,0,0.46724211122116882]
[5,"American samoa","ASM",null,null,"OC",null,null,"UPPER-MIDDLE-INCOME","No data, regional estimates only ",null,null,"American samoa",0.75,0.96153846153846156,0.97058823529411764,0.60897435897435892,0.88988095238095233,0.85555555555555562,0.60902255639097747,0.875,0.64583333333333326,0.53125,0.61578947368421044,0.66161616161616155,0.60714285714285721,0.48214285714285715,0.46527777777777779,0.16666666666666666,0.42857142857142855,0.42483660130718959,0.3833333333333333,0.16666666666666666,0.11764705882352941,0.30952380952380953,0.4494949494949495,0.3771929824561403,0.28205128205128205,0.35,0.28030303030303028,0.14250000000000002,0.3345588235294118,0.14761904761904762,0.10416666666666667,0.10555555555555556,0.125,0.26250000000000001,0.32500000000000001,0.22916666666666666,0.46261759561291543]
[6,"Andorra","AND",null,null,"WE",null,null,"HIGH-INCOME","No data",null,null,"Andorra"]
[7,"Angola","AGO","Angola","DHS-Angola 2015-2016","ESA","Middle Africa","Sub-Saharan Africa","LOWER-MIDDLE INCOME","Full data, Source: DHS",null,"2015-16","Angola",0.88976377952755903,0.92700729927007297,0.89436619718309862,0.94557823129251706,0.92982456140350878,0.87407407407407411,0.96478873239436624,0.90243902439024393,0.92173913043478262,0.84112149532710279,0.90839694656488545,0.88372093023255816,0.84172661870503596,0.87401574803149606,0.79487179487179482,0.81147540983606559,0.83185840707964598,0.66923076923076918,0.72649572649572647,0.61111111111111116,0.5267857142857143,0.51818181818181819,0.42857142857142855,0.40336134453781514,0.38775510204081631,0.28440366972477066,0.45370370370370372,0.46391752577319589,0.42857142857142855,0.36936936936936937,0.39344262295081966,0.37168141592920356,0.46153846153846156,0.42156862745098039,0.4732142857142857,0.46739130434782611,0.57377049180327866,0.55000000000000004,0.55737704918032782,0.57547169811320753,0.38596491228070173,0.52892561983471076,0.46400000000000002,0.52173913043478259,0.51578947368421058,0.48958333333333331,0.52727272727272723,0.52272727272727271,0.50909090909090904,0.4777777777777778,0.39361702127659576,0.45054945054945056,0.42424242424242425,0.5130434782608696,0.45121951219512196,0.43209876543209874,0.53333333333333333,0.50877192982456143,0.44086021505376344,0.44,0.61611234294161121]
[8,"Anguilla","AIA",null,null,"LAC",null,null,null,"No data",null,null,"Anguilla"]
[9,"Antigua and Barbuda","ATG",null,null,"LAC",null,null,"HIGH-INCOME","No data, regional estimates only ",null,null,"Antigua and Barbuda",0.97399999999999998,0.82657004830917868,0.65079365079365081,0.95833333333333337,0.7321428571428571,0.68085714285714283,0.41203703703703703,0.9,0.33333333333333331,0.39999999999999997,0.44716775599128544,0.33866666666666662,0.53174603174603174,0.56944444444444453,0.40740740740740738,0.50151515151515158,0.32234432234432231,0.1111111111111111,0.33333333333333331,0.42222222222222222,0.23333333333333331,0.30952380952380953,0.12698412698412698,0.23021442495126701,0.17063492063492061,0.11929824561403508,0.11428571428571428,0.15555555555555556,9.0909090909090898E-2,0.10416666666666667,0.10000000000000002,0.10256410256410257,0.17261904761904759,6.25E-2,0.15764895330112719,0.1396103896103896,7.6923076923076927E-2,4.6875E-2,2.1739130434782608E-2,8.6956521739130432E-2,0.16666666666666669,0,2.7777777777777776E-2,0,0.17142857142857143,0.1,6.8181818181818177E-2,0.06,2.7777777777777776E-2,0.05,4.7619047619047616E-2,0,0.02,0,0,4.5454545454545456E-2,8.3333333333333329E-2,0,0,0.05,0.25920313016642788]
[10,"Argentina","ARG","Argentina","MICS-Argentina  2019-2020","LAC","South America","Latin America and the Caribbean","UPPER-MIDDLE-INCOME","Full data, Source: MICS",null,"2019-20","Argentina",0.97777777777777775,0.92957746478873238,0.98039215686274506,0.91044776119402981,0.83783783783783783,0.89743589743589747,0.83132530120481929,0.79220779220779225,0.87356321839080464,0.72941176470588232,0.75324675324675328,0.7722772277227723,0.6696428571428571,0.52040816326530615,0.69791666666666663,0.62650602409638556,0.55913978494623651,0.57831325301204817,0.43037974683544306,0.51898734177215189,0.56880733944954132,0.57446808510638303,0.46,0.46808510638297873,0.37755102040816324,0.35416666666666669,0.35416666666666669,0.27835051546391754,0.27906976744186046,0.20408163265306123,0.28846153846153844,0.28888888888888886,0.17757009345794392,0.23893805309734514,0.19230769230769232,0.21428571428571427,0.53276889306992792]
[11,"Armenia","ARM","Armenia","DHS-Armenia 2015-2016","EECA","Western Asia","Western Asia and Northern Africa","UPPER-MIDDLE-INCOME","Full data, Source: DHS",null,"2015-2016","Armenia",0.8666666666666667,0.89743589743589747,0.78181818181818186,0.83050847457627119,0.85365853658536583,0.88235294117647056,0.77500000000000002,0.79411764705882348,0.77142857142857146,0.73684210526315785,0.71153846153846156,0.78846153846153844,0.6428571428571429,0.57692307692307687,0.64444444444444449,0.63829787234042556,0.375,0.51219512195121952,0.33333333333333331,0.25641025641025639,0.43396226415094341,0.35294117647058826,0.36734693877551022,0.28888888888888886,0.16071428571428573,0.30909090909090908,0.14545454545454545,0.1702127659574468,0.20408163265306123,0.27500000000000002,0.16279069767441862,0.20408163265306123,0.16216216216216217,0.14583333333333334,8.8235294117647065E-2,5.7142857142857141E-2,0.16,0.13725490196078433,0.24074074074074073,0.13043478260869565,0.18,0.16666666666666666,0.19047619047619047,0.17948717948717949,8.5106382978723402E-2,0.27027027027027029,0.19047619047619047,0.12195121951219512,0.10638297872340426,0.25641025641025639,0.17073170731707318,5.3571428571428568E-2,0.10638297872340426,8.3333333333333329E-2,0.125,0.23255813953488372,0.30232558139534882,0.3,8.5106382978723402E-2,0.14634146341463414,0.3509687034277198]
[12,"Aruba","ABW",null,null,"LAC",null,null,"HIGH-INCOME","No data, regional estimates only ",null,null,"Aruba",0.97399999999999998,0.82657004830917868,0.65079365079365081,0.95833333333333337,0.7321428571428571,0.68085714285714283,0.41203703703703703,0.9,0.33333333333333331,0.39999999999999997,0.44716775599128544,0.33866666666666662,0.53174603174603174,0.56944444444444453,0.40740740740740738,0.50151515151515158,0.32234432234432231,0.1111111111111111,0.33333333333333331,0.42222222222222222,0.23333333333333331,0.30952380952380953,0.12698412698412698,0.23021442495126701,0.17063492063492061,0.11929824561403508,0.11428571428571428,0.15555555555555556,9.0909090909090898E-2,0.10416666666666667,0.10000000000000002,0.10256410256410257,0.17261904761904759,6.25E-2,0.15764895330112719,0.1396103896103896,7.6923076923076927E-2,4.6875E-2,2.1739130434782608E-2,8.6956521739130432E-2,0.16666666666666669,0,2.7777777777777776E-2,0,0.17142857142857143,0.1,6.8181818181818177E-2,0.06,2.7777777777777776E-2,0.05,4.7619047619047616E-2,0,0.02,0,0,4.5454545454545456E-2,8.3333333333333329E-2,0,0,0.05,0.25920313016642788]
[13,"Australia","AUS",null,null,"OC",null,null,"HIGH-INCOME","Partial data, Source: National survey",null,"2010","Australia",0.90200000000000002,0.746,0.72699999999999998,0.70299999999999996,0.68700000000000006,0.629,0.60099999999999998,0.42199999999999999,0.42199999999999999,0.42199999999999999,0.42199999999999999,0.42199999999999999,0.42199999999999999,0.182,0.182,0.182,0.182,0.182,0.182,7.3999999999999996E-2,7.3999999999999996E-2,7.3999999999999996E-2,7.3999999999999996E-2,7.3999999999999996E-2]
[14,"Austria","AUT",null,null,"WE",null,null,"HIGH-INCOME","Partial data, Source: National survey",null,"2006","Austria",0.93,null,null,null,null,0.42,null,null,null,null,null,0.16]
[15,"Azerbaijan","AZE","Azerbaijan","DHS-Azerbajian 2006","EECA","Western Asia","Western Asia and Northern Africa","UPPER-MIDDLE-INCOME","Full data, Source: DHS",null,"2006","Azerbaijan",0.95238095238095233,0.92156862745098034,0.8125,0.84444444444444444,0.73333333333333328,0.78125,0.60526315789473684,0.61363636363636365,0.5641025641025641,0.42857142857142855,0.46875,0.27777777777777779,0.40476190476190477,0.32608695652173914,0.23333333333333334,0.34285714285714286,0.37209302325581395,0.44117647058823528,0.32258064516129031,0.16216216216216217,0.25714285714285712,0.22857142857142856,0.32432432432432434,0.28125,0.28846153846153844,0.30232558139534882,0.22500000000000001,0.2608695652173913,0.15384615384615385,0.16,0.21428571428571427,0.21875,0.12,0.16666666666666666,0.15151515151515152,0.18421052631578946,0.13636363636363635,0.13953488372093023,9.0909090909090912E-2,0.15384615384615385,5.5555555555555552E-2,0.15151515151515152,0.20689655172413793,0.13157894736842105,0.17857142857142858,0.22500000000000001,0.17499999999999999,0.1111111111111111,0.10416666666666667,0.08,0.13157894736842105,0.21875,7.407407407407407E-2,8.3333333333333329E-2,8.8235294117647065E-2,0.24,9.6774193548387094E-2,0.19230769230769232,0.15555555555555556,3.3333333333333333E-2,0.29931350114416477]
[16,"Bahamas","BHS",null,null,"LAC",null,null,"HIGH-INCOME","No data, regional estimates only ",null,null,"Bahamas",0.97399999999999998,0.82657004830917868,0.65079365079365081,0.95833333333333337,0.7321428571428571,0.68085714285714283,0.41203703703703703,0.9,0.33333333333333331,0.39999999999999997,0.44716775599128544,0.33866666666666662,0.53174603174603174,0.56944444444444453,0.40740740740740738,0.50151515151515158,0.32234432234432231,0.1111111111111111,0.33333333333333331,0.42222222222222222,0.23333333333333331,0.30952380952380953,0.12698412698412698,0.23021442495126701,0.17063492063492061,0.11929824561403508,0.11428571428571428,0.15555555555555556,9.0909090909090898E-2,0.10416666666666667,0.10000000000000002,0.10256410256410257,0.17261904761904759,6.25E-2,0.15764895330112719,0.1396103896103896,7.6923076923076927E-2,4.6875E-2,2.1739130434782608E-2,8.6956521739130432E-2,0.16666666666666669,0,2.7777777777777776E-2,0,0.17142857142857143,0.1,6.8181818181818177E-2,0.06,2.7777777777777776E-2,0.05,4.7619047619047616E-2,0,0.02,0,0,4.5454545454545456E-2,8.3333333333333329E-2,0,0,0.05,0.25920313016642788]
[17,"Bahrain","BHR",null,null,"MENA",null,null,"HIGH-INCOME","No data, regional estimates only ",null,null,"Bahrain",0.89555555555555555,1,0.93548387096774188,0.91666666666666663,1,0.37393162393162394,0.75609756097560976,0.72727272727272729,0.65384615384615385,0.70731707317073167,0.61702127659574468,0.52333333333333332,0.52631578947368418,0.70967741935483875,0.63636363636363635,0.61538461538461542,0.57894736842105265,0.52380952380952384,0.375,0.21875,0.36363636363636365,0.34482758620689657,0.33333333333333331,0.13157894736842105,0.11764705882352941,0.13793103448275862,0.21621621621621623,0.16216216216216217,0.10256410256410256,0.12121212121212122,8.3333333333333329E-2,0.27272727272727271,5.2631578947368418E-2,0,0.08,7.8947368421052627E-2,6.6666666666666666E-2,5.4545454545454543E-2,5.7142857142857141E-2,6.6666666666666666E-2,0.05,0.10344827586206896,9.0909090909090912E-2,0,4.3478260869565216E-2,0.08,3.4482758620689655E-2,0,0,2.4390243902439025E-2,2.564102564102564E-2,7.1428571428571425E-2,8.8235294117647065E-2,3.0303030303030304E-2,4.5454545454545456E-2,0.05,3.7037037037037035E-2,0,0.1111111111111111,0,0.29205851619644724]
[18,"Bangladesh","BGD","Bangladesh","Bangla 2019","SA","Southern Asia","Central Asia and Southern Asia","LOWER-MIDDLE INCOME","Full data, Source: MICS",null,2019,"Bangladesh",1,1,0.98,1,0.98,0.99,0.98,0.98,0.98,0.97,0.97,0.97,0.96,0.96,0.95,0.94,0.94,0.95,0.91,0.94,0.91,0.89,0.89,0.84,0.76,0.74,0.67,0.62,0.64,0.54,0.47,0.46,0.48,0.46,0.39,0.41]
[19,"Barbados","BRB","Barbados","Barbados 2012","LAC","Caribbean","Latin America and the Caribbean","HIGH-INCOME","Full data, Source: MICS",null,"2012","Barbados",1,0.9,1,1,0.75,0.75,0.625,1,0.5,0.5,0.44444444444444442,0.5,0.66666666666666663,0.83333333333333337,0.33333333333333331,0.8,0.42857142857142855,0,0.375,0.66666666666666663,0.2,0.42857142857142855,0.14285714285714285,0.22222222222222221,0.33333333333333331,0.2,0.14285714285714285,0.16666666666666666,0,0,0.2,0,0,0,0.2,0.14285714285714285,0,0,0,0,0.2,0,0,0,0.2,0,0,0,0,0,0,0,0,0,0,0,0.16666666666666666,0,0,0,0.23933649289099526]
[20,"Belarus","BLR","Belarus","Belarus 2019","EECA","Eastern Europe","Northern America and Europe","UPPER-MIDDLE-INCOME","Full data, Source: MICS",null,"2019","Belarus",0.76923076923076927,0.72413793103448276,0.61111111111111116,0.75609756097560976,0.47619047619047616,0.51063829787234039,0.48717948717948717,0.38,0.48979591836734693,0.27777777777777779,0.4,0.27450980392156865,0.3783783783783784,0.34693877551020408,0.25,0.12698412698412698,0.2,0.19672131147540983,0.125,0.1,0.20338983050847459,0.11904761904761904,0.16363636363636364,0.13636363636363635,7.6923076923076927E-2,3.7037037037037035E-2,5.8823529411764705E-2,0.1,5.2631578947368418E-2,9.0909090909090912E-2,0,2.9411764705882353E-2,1.5625E-2,1.5625E-2,3.4482758620689655E-2,1.8181818181818181E-2,null,0.2123059866962306]
[21,"Belgium","BEL",null,null,"WE",null,null,"HIGH-INCOME","No data",null,null,"Belgium"]
[22,"Belize","BLZ","Belize","Belize 2011","LAC","Central America","Latin America and the Caribbean","LOWER-MIDDLE INCOME","Full data, Source: MICS",null,"2011","Belize",0.96153846153846156,1,0.92307692307692313,0.8571428571428571,0.93333333333333335,0.81818181818181823,0.76923076923076927,0.73333333333333328,0.76190476190476186,0.78378378378378377,0.68421052631578949,0.6,0.7857142857142857,0.62962962962962965,0.65714285714285714,0.52380952380952384,0.56521739130434778,0.5357142857142857,0.48571428571428571,0.39393939393939392,0.5,0.42105263157894735,0.35294117647058826,0.16666666666666666,0.19047619047619047,0.31428571428571428,0.2,0.23076923076923078,0.13793103448275862,0.22222222222222221,0.14285714285714285,0.20689655172413793,8.3333333333333329E-2,0.13513513513513514,0.15151515151515152,9.0909090909090912E-2,9.5238095238095233E-2,7.6923076923076927E-2,0,0.13636363636363635,6.25E-2,8.3333333333333329E-2,3.7037037037037035E-2,2.2222222222222223E-2,0.1,3.0303030303030304E-2,5.2631578947368418E-2,3.3333333333333333E-2,4.3478260869565216E-2,0,0,7.6923076923076927E-2,0,3.7037037037037035E-2,0,0,0,2.564102564102564E-2,0,0,0.30857142857142855]
[23,"Benin","BEN","Benin","DHS-Benin 2017-2018","WCA","Western Africa","Sub-Saharan Africa","LOWER-MIDDLE INCOME","Full data, Source: DHS",null,"2017-2018","Benin",0.95094339622641511,0.96610169491525422,0.95473251028806583,0.96536796536796532,0.98156682027649766,0.976303317535545,0.95769230769230773,0.97037037037037033,0.96762589928057552,0.96015936254980083,0.96062992125984248,0.93269230769230771,0.95360824742268047,0.92165898617511521,0.88,0.86528497409326421,0.85,0.74774774774774777,0.73364485981308414,0.65284974093264247,0.53333333333333333,0.47663551401869159,0.45454545454545453,0.36046511627906974,0.31,0.21465968586387435,0.26842105263157895,0.22777777777777777,0.27167630057803466,0.31155778894472363,0.29569892473118281,0.32417582417582419,0.32057416267942584,0.40217391304347827,0.39912280701754388,0.45624999999999999,0.4585635359116022,0.4891304347826087,0.45365853658536587,0.53513513513513511,0.47976878612716761,0.53191489361702127,0.46808510638297873,0.52910052910052907,0.5027932960893855,0.46728971962616822,0.55109489051094895,0.4942528735632184,0.45789473684210524,0.49152542372881358,0.50289017341040465,0.5,0.46666666666666667,0.44970414201183434,0.47058823529411764,0.44086021505376344,0.34972677595628415,0.42922374429223742,0.46303501945525294,0.44117647058823528,0.60778394255874668]
[24,"Bermuda","BMU",null,null,"NA",null,null,"HIGH-INCOME","No data",null,null,"Bermuda"]
[25,"Bhutan","BTN","Bhutan","Bhutan 2010","SA","Southern Asia","Central Asia and Southern Asia","LOWER-MIDDLE INCOME","Full data, Source: MICS",null,2010,"Bhutan",1,0.99038461538461542,0.9907407407407407,1,1,0.99122807017543857,0.98305084745762716,0.9921875,0.97222222222222221,0.99145299145299148,0.98901098901098905,0.98684210526315785,0.92553191489361697,0.93396226415094341,0.92035398230088494,0.84259259259259256,0.90566037735849059,0.80869565217391304,0.78761061946902655,0.81481481481481477,0.75187969924812026,0.64485981308411211,0.63043478260869568,0.61445783132530118,0.45528455284552843,0.40163934426229508,0.46296296296296297,0.38636363636363635,0.31313131313131315,0.43564356435643564,0.26363636363636361,0.25454545454545452,0.34453781512605042,0.22222222222222221,0.25438596491228072,0.15555555555555556,0.15178571428571427,0.11475409836065574,0.12612612612612611,9.3220338983050849E-2,0.10869565217391304,0.1206896551724138,7.2289156626506021E-2,0.10434782608695652,2.197802197802198E-2,9.6153846153846159E-2,0.11458333333333333,4.49438202247191E-2,6.4220183486238536E-2,6.5040650406504072E-2,3.2258064516129031E-2,2.6785714285714284E-2,5.1724137931034482E-2,4.6511627906976744E-2,3.6585365853658534E-2,2.1505376344086023E-2,4.4117647058823532E-2,1.2500000000000001E-2,3.0769230769230771E-2,3.3898305084745763E-2,0.46238118253584665]
[26,"Bolivia (Plurinational State of)","BOL","Bolivia (Plurinational State of)","DHS-Bolivia 2008","LAC","South America","Latin America and the Caribbean","LOWER-MIDDLE INCOME","Full data, Source: DHS",null,"2008","Bolivia (Plurinational State of)",1,0.9882352941176471,0.98639455782312924,0.97163120567375882,0.97142857142857142,0.93525179856115104,0.95652173913043481,0.92561983471074383,0.94160583941605835,0.92086330935251803,0.92198581560283688,0.9285714285714286,0.87121212121212122,0.8,0.84827586206896555,0.83211678832116787,0.68309859154929575,0.61832061068702293,0.67361111111111116,0.55629139072847678,0.52054794520547942,0.48062015503875971,0.3888888888888889,0.34,0.45098039215686275,0.4,0.37323943661971831,0.41025641025641024,0.36923076923076925,0.2982456140350877,0.29545454545454547,0.3263888888888889,0.40298507462686567,0.38260869565217392,0.34415584415584416,0.28225806451612906,0.34782608695652173,0.33112582781456956,0.38970588235294118,0.31468531468531469,0.31623931623931623,0.27067669172932329,0.29545454545454547,0.27731092436974791,0.29357798165137616,0.3037037037037037,0.31818181818181818,0.28169014084507044,0.26923076923076922,0.265625,0.23478260869565218,0.29197080291970801,0.29365079365079366,0.24166666666666667,0.34459459459459457,0.30534351145038169,0.2283464566929134,0.22142857142857142,0.29661016949152541,0.33333333333333331,0.5130391793350636]
[27,"Bosnia and Herzegovina","BIH","Bosnia and Herzegovina","Bosnia 2012","EECA","Southern Europe","Northern America and Europe","UPPER-MIDDLE-INCOME","Full data, Source: MICS",null,"2012","Bosnia and Herzegovina",0.88888888888888884,0.84210526315789469,0.91304347826086951,0.58823529411764708,0.8,0.875,0.77777777777777779,0.55000000000000004,0.25,0.5625,0.59259259259259256,0.31034482758620691,0.25925925925925902,0.11764705882352941,0.15,0.13953488372093023,0.17241379310344829,0.15909090909090909,9.0909090909090912E-2,0.10869565217391304,0.16949152542372881,0.21052631578947367,3.7037037037037035E-2,2.8571428571428571E-2,0.10344827586206896,2.8571428571428571E-2,2.0408163265306121E-2,0,2.9411764705882353E-2,2.7027027027027029E-2,4.878048780487805E-2,2.0833333333333332E-2,2.7777777777777776E-2,6.5217391304347824E-2,2.3809523809523808E-2,0,5.8823529411764705E-2,0,0,0,0,0,0,0,0,0,1.9607843137254902E-2,0,0,0,0,0,0,0,0,0,0,0,0,0,0.11214953271028037]
[28,"Botswana","BWA","Botswana","Botswana 2000","ESA","Southern Africa","Sub-Saharan Africa","UPPER-MIDDLE-INCOME","Full data, Source: MICS",null,"2000","Botswana",1,1,0.92982456140350878,0.9107142857142857,0.91666666666666663,0.94827586206896552,0.85483870967741937,0.85,0.84444444444444444,0.85185185185185186,0.79591836734693877,0.82692307692307687,0.74358974358974361,0.55172413793103448,0.68085106382978722,0.68181818181818177,0.41818181818181815,0.46153846153846156,0.41818181818181815,0.2711864406779661,0.34285714285714286,0.12820512820512819,0.1702127659574468,8.5106382978723402E-2,9.3023255813953487E-2,3.3333333333333333E-2,0.10714285714285714,0.08,2.5000000000000001E-2,0.05,2.3255813953488372E-2,0,2.5000000000000001E-2,2.2727272727272728E-2,0,2.7027027027027029E-2,4.6511627906976744E-2,2.7027027027027029E-2,0,1.4705882352941176E-2,0,0,0,0,0,0,0,0,0,0,0,1.7543859649122806E-2,2.0833333333333332E-2,3.0303030303030304E-2,1.6949152542372881E-2,0,4.5454545454545456E-2,0,0,3.0303030303030304E-2,0]
[29,"Brazil","BRA",null,null,"LAC",null,null,"UPPER-MIDDLE-INCOME",null,null,"2019","Brazil",0.36599999999999999,0.36599999999999999,0.36599999999999999,0.36599999999999999,0.36599999999999999,0.36599999999999999,null,null,null,null,null,null,0.45399999999999996,0.45399999999999996,0.45399999999999996,0.45399999999999996,null,null,null,null,0.318,0.318,0.318,0.318]
[30,"British Virgin Island","VGB",null,null,"LAC",null,null,"HIGH-INCOME","No data, regional estimates only ",null,null,"British Virgin Island",0.97399999999999998,0.82657004830917868,0.65079365079365081,0.95833333333333337,0.7321428571428571,0.68085714285714283,0.41203703703703703,0.9,0.33333333333333331,0.39999999999999997,0.44716775599128544,0.33866666666666662,0.53174603174603174,0.56944444444444453,0.40740740740740738,0.50151515151515158,0.32234432234432231,0.1111111111111111,0.33333333333333331,0.42222222222222222,0.23333333333333331,0.30952380952380953,0.12698412698412698,0.23021442495126701,0.17063492063492061,0.11929824561403508,0.11428571428571428,0.15555555555555556,9.0909090909090898E-2,0.10416666666666667,0.10000000000000002,0.10256410256410257,0.17261904761904759,6.25E-2,0.15764895330112719,0.1396103896103896,7.6923076923076927E-2,4.6875E-2,2.1739130434782608E-2,8.6956521739130432E-2,0.16666666666666669,0,2.7777777777777776E-2,0,0.17142857142857143,0.1,6.8181818181818177E-2,0.06,2.7777777777777776E-2,0.05,4.7619047619047616E-2,0,0.02,0,0,4.5454545454545456E-2,8.3333333333333329E-2,0,0,0.05,0.25920313016642788]
[31,"Brunei Darussalam","BRN",null,null,"SEA",null,null,"HIGH-INCOME","No data, regional estimates only  ",null,null,"Brunei Darussalam",0.94874999999999998,0.82978723404255317,0.79844961240310075,0.78400000000000003,0.73015873015873012,0.50411764705882356,0.51515151515151514,0.50632911392405067,0.50724637681159424,0.43965517241379309,0.42922374429223742,0.26594017094017097,0.39408866995073893,0.27102803738317754,0.25738396624472576,0.27751196172248804,0.25870646766169153,0.25,0.23275862068965517,0.21333333333333335,0.17279411764705882,0.17509727626459143,0.1875,0.12916666666666668,0.1004566210045662,0.13168724279835392,9.3617021276595741E-2,8.0586080586080591E-2,7.1729957805907171E-2,9.2105263157894732E-2,7.3593073593073599E-2,4.8979591836734691E-2,6.8181818181818177E-2,9.3877551020408165E-2,7.0370370370370375E-2,5.2083333333333336E-2,0.25957222075521519]
[32,"Bulgaria","BGR",null,null,"EECA",null,null,"UPPER-MIDDLE-INCOME","No data, regional estimates only ",null,null,"Bulgaria",0.93828584114298408,0.90657401452143127,0.83831720583392833,0.80420356106076651,0.77999394700293279,0.76443069456325852,0.70672871215328759,0.68961199933900774,0.62536857525868517,0.60938787136702033,0.60137389394221374,0.53710596548614575,0.52341398552885865,0.46742037748054144,0.44345693393535801,0.39802916505826469,0.36542293910910273,0.36232258041131965,0.26973416153197244,0.21047711134045732,0.27808811392384852,0.23240677002510496,0.22150380092280775,0.17985622462867853,0.14965769640194215,0.15033487492923706,0.1144601027500243,9.3838548461894003E-2,0.10948571262991005,0.1160557380279478,0.10150246346146531,8.6729063616801452E-2,7.6540313401296092E-2,6.7017598305179255E-2,5.9606153024554742E-2,6.4928303916183511E-2,0.1003838808250573]
[33,"Burkina Faso","BFA","Burkina Faso","Burkina Faso 2006","WCA","Western Africa","Sub-Saharan Africa","LOW-INCOME","Full data, Source: MICS",null,"2006","Burkina Faso",0.96,0.97727272727272729,0.94339622641509435,0.953125,0.95294117647058818,0.91954022988505746,0.93055555555555558,0.96875,0.93243243243243246,0.90277777777777779,0.74545454545454548,0.88059701492537312,0.70491803278688525,0.54887218045112784,0.44444444444444442,0.38793103448275862,0.3888888888888889,0.17741935483870969,0.14444444444444443,0.17582417582417584,0.11904761904761904,0.19047619047619047,0.12048192771084337,0.20588235294117646,0.13953488372093023,7.8125E-2,5.0847457627118647E-2,5.8823529411764705E-2,4.3956043956043959E-2,3.614457831325301E-2,3.896103896103896E-2,1.4084507042253521E-2,2.8169014084507043E-2,1.4925373134328358E-2,9.375E-2,2.4096385542168676E-2,5.6603773584905662E-2,3.0927835051546393E-2,1.5748031496062992E-2,3.8095238095238099E-2,3.896103896103896E-2,2.0408163265306121E-2,1.8867924528301886E-2,0,0,1.8181818181818181E-2,0,0,0.49723440778180433]
[34,"Burundi","BDI","Burundi","DHS-Burundi 2016-2017","ESA","Eastern Africa","Sub-Saharan Africa","LOW-INCOME","Full data, Source: DHS",null,"2016-17","Burundi",0.94545454545454544,0.98795180722891562,0.99038461538461542,0.9642857142857143,0.95370370370370372,1,0.97674418604651159,0.99047619047619051,0.97810218978102192,0.98373983739837401,0.99056603773584906,0.95726495726495731,0.97435897435897434,0.9642857142857143,0.92173913043478262,0.88775510204081631,0.93846153846153846,0.90291262135922334,0.93043478260869561,0.85148514851485146,0.85416666666666663,0.88235294117647056,0.73195876288659789,0.68269230769230771,0.74528301886792447,0.70476190476190481,0.64130434782608692,0.65263157894736845,0.61176470588235299,0.66055045871559637,0.61818181818181817,0.55769230769230771,0.63366336633663367,0.57608695652173914,0.58227848101265822,0.5679012345679012,0.51807228915662651,0.48863636363636365,0.65909090909090906,0.65957446808510634,0.52631578947368418,0.54285714285714282,0.55882352941176472,0.57831325301204817,0.53,0.5494505494505495,0.6811594202898551,0.54736842105263162,0.56310679611650483,0.57843137254901966,0.55789473684210522,0.56818181818181823,0.59433962264150941,0.6228070175438597,0.65740740740740744,0.54166666666666663,0.62608695652173918,0.63478260869565217,0.51960784313725494,0.58715596330275233,0.73802493438320205]
[35,"Cabo Verde","CPV",null,null,"WCA",null,null,"LOWER-MIDDLE INCOME","No data, regional estimates only  ",null,null,"Cabo Verde",0.98142568103848626,0.98341826586125058,0.98644725488596074,0.98438742110620681,0.98948388458567194,0.98366744274948537,0.95388720114780101,0.9721028129599234,0.961338424163796,0.96428063306380474,0.95548835851089309,0.94125935907104241,0.89639734554125106,0.8776731610025561,0.81383625545503036,0.78344816743692924,0.73090059766233617,0.64660405792892472,0.5811243719926471,0.50077763694849542,0.41161061268598775,0.30872042431330571,0.30055083193785181,0.23809669176449344,0.17610724795868496,0.13082179536673919,0.13707444619085918,0.11730045401728027,0.11730912378857106,0.12827338433767929,0.13010058804861671,0.13502654556554367,0.13567010060788437,0.15463869552241979,0.1419231652865281,0.15967124521494255,0.15225742609302761,0.35652330779743763,0.22786052821998604,0.27675232003549377,0.24552516247032088,0.25331424621625603,0.23316792247771459,0.27624511157119852,0.25944664326936906,0.24230029924644519,0.2372924246918022,0.21392774281891971,0.2357235010450075,0.23342501480313763,0.25567259512354124,0.22380439980870398,0.2248392659879678,0.20607441860986703,0.23298663727786195,0.22255594404211282,0.18481920390633272,0.20887615136043836,0.20345263774983624,0.21364732181993512,0.47526952744683759]
[36,"Cambodia","KHM","Cambodia","DHS-Cambodia 2014","SEA","South-Eastern Asia","Eastern Asia and South-eastern Asia","LOWER-MIDDLE INCOME","Full data, Source: DHS",null,"2014","Cambodia",0.94736842105263153,0.93684210526315792,0.90909090909090906,0.9178082191780822,0.92771084337349397,0.87234042553191493,0.90243902439024393,0.95238095238095233,0.78409090909090906,0.87356321839080464,0.89473684210526316,0.89473684210526316,0.86746987951807231,0.82539682539682535,0.84337349397590367,0.75294117647058822,0.76,0.76056338028169013,0.54320987654320985,0.46153846153846156,0.53465346534653468,0.3902439024390244,0.26250000000000001,0.33333333333333331,0.41975308641975306,0.17721518987341772,0.25675675675675674,0.26470588235294118,0.24590163934426229,0.24050632911392406,0.25675675675675674,0.24096385542168675,0.29333333333333333,0.19718309859154928,0.19117647058823528,0.32051282051282054,0.16901408450704225,0.28915662650602408,0.16666666666666666,0.21428571428571427,0.22222222222222221,0.19117647058823528,0.27586206896551724,0.21052631578947367,0.18032786885245902,0.26315789473684209,0.375,0.23287671232876711,0.2,0.25396825396825395,0.25714285714285712,0.1076923076923077,0.35384615384615387,0.2153846153846154,0.23655913978494625,0.2073170731707317,0.23880597014925373,0.2,0.10810810810810811,0.23076923076923078,0.45748449955713022]
[37,"Cameroon","CMR","Cameroon","Cameron 2016","WCA","Middle Africa","Sub-Saharan Africa","LOWER-MIDDLE INCOME","Full data, Source: MICS",null,"2016","Cameroon",1,0.99099099099099097,0.99186991869918695,0.98540145985401462,1,0.97777777777777775,0.92700729927007297,0.94318181818181823,0.93388429752066116,0.89552238805970152,0.89743589743589747,0.85981308411214952,0.79104477611940294,0.72307692307692306,0.66666666666666663,0.59701492537313428,0.496,0.50847457627118642,0.39449541284403672,0.26446280991735538,0.17475728155339806,0.16071428571428573,0.20930232558139536,0.17757009345794392,7.6923076923076927E-2,3.4482758620689655E-2,9.6296296296296297E-2,5.4263565891472867E-2,5.46875E-2,2.8169014084507043E-2,4.4642857142857144E-2,5.2631578947368418E-2,3.2258064516129031E-2,2.0833333333333332E-2,0,0,3.8461538461538464E-2,0.48]
[38,"Canada","CAN",null,null,"NA",null,null,"HIGH-INCOME","Partial data, Source: National survey",null,"2011-12","Canada",0.89,null,null,null,null,0.3,null,null,null,null,null,0.09]
[39,"Cayman Island","CYM",null,null,"LAC",null,null,"HIGH-INCOME","No data, regional estimates only ",null,null,"Cayman Island",0.97399999999999998,0.82657004830917868,0.65079365079365081,0.95833333333333337,0.7321428571428571,0.68085714285714283,0.41203703703703703,0.9,0.33333333333333331,0.39999999999999997,0.44716775599128544,0.33866666666666662,0.53174603174603174,0.56944444444444453,0.40740740740740738,0.50151515151515158,0.32234432234432231,0.1111111111111111,0.33333333333333331,0.42222222222222222,0.23333333333333331,0.30952380952380953,0.12698412698412698,0.23021442495126701,0.17063492063492061,0.11929824561403508,0.11428571428571428,0.15555555555555556,9.0909090909090898E-2,0.10416666666666667,0.10000000000000002,0.10256410256410257,0.17261904761904759,6.25E-2,0.15764895330112719,0.1396103896103896,7.6923076923076927E-2,4.6875E-2,2.1739130434782608E-2,8.6956521739130432E-2,0.16666666666666669,0,2.7777777777777776E-2,0,0.17142857142857143,0.1,6.8181818181818177E-2,0.06,2.7777777777777776E-2,0.05,4.7619047619047616E-2,0,0.02,0,0,4.5454545454545456E-2,8.3333333333333329E-2,0,0,0.05,0.25920313016642788]
[40,"Central African Republic","CAF","Central African Republic","CAR2018_19","WCA","Middle Africa","Sub-Saharan Africa","LOW-INCOME","Full data, Source: MICS",null,"2018-19","Central African Republic",1,1,0.99,1,0.99,0.99,0.99,0.98,0.98,0.98,0.98,0.95,0.95,0.92,0.91,0.84,0.74,0.79,0.7,0.64,0.55000000000000004,0.51,0.47,0.27,0.19,0.16,0.17,0.12,0.12,0.08,0.04,7.0000000000000007E-2,0.09,7.0000000000000007E-2,0.08,0.08,0.65]
[41,"Chad","TCD","Chad","Chad 2019","WCA","Middle Africa","Sub-Saharan Africa","LOW-INCOME","Full data, Source: MICS",null,"2019","Chad",1,0.99,0.98,1,0.99,0.99,0.97,0.99,0.99,0.99,0.98,0.96,0.9,0.89,0.89,0.85,0.83,0.8,0.73,0.73,0.68,0.57999999999999996,0.54,0.42,0.16,0.15,0.14000000000000001,0.12,0.1,0.11,0.13,0.08,0.06,0.05,0.06,0.04,0,0.65]
[42,"Channel Islands","GB",null,null,"WE",null,null,"HIGH-INCOME","No data",null,null,"Channel Islands"]
[43,"Chile","CHL",null,null,"LAC",null,null,"HIGH-INCOME","Partial data: Source: Health records",null,"2011-12","Chile",0.89,null,null,null,null,0.3,null,null,null,null,null,0.09]
[44,"China","CHN",null,null,"EA",null,null,"UPPER-MIDDLE-INCOME","No data",null,null,"China"]
[45,"China, Hong Kong SAR","HKG",null,null,"EA",null,null,"HIGH-INCOME","No data",null,null,"China, Hong Kong SAR",{"$f":"AVERAGE(N49:N50)","v":0.9295244903510973},null,null,null,null,{"$f":"AVERAGE(S49:S50)","v":0.87365696388492697},null,null,null,null,null,{"$f":"AVERAGE(Y49:Y50)","v":0.69423991796451756}]
[46,"China, Macao SAR","MAC",null,null,"EA",null,null,"HIGH-INCOME","No data",null,null,"China, Macao SAR",0.91500000000000004,null,null,null,null,0.62,null,null,null,null,null,0.53]
[47,"China, Taiwan Province of China","TWN",null,null,"EA",null,null,"HIGH-INCOME","No data",null,null,"China, Taiwan Province of China",0.91500000000000004,null,null,null,null,0.62,null,null,null,null,null,0.53]
[48,"Colombia","COL",null,null,"LAC",null,null,"UPPER-MIDDLE-INCOME","No data, regional estimates only ",null,null,"Colombia",0.98404898070219449,0.95114981845932112,0.91419125081647223,0.89928898699090765,0.82955802847107174,0.80853841756577227,0.76929757681852406,0.66910043507624073,0.6956451462085389,0.68418395249350406,0.63900699390709026,0.63847983592903501,0.55595417591809237,0.52340583884260383,0.52681197053092432,0.48175836710521525,0.4310656803179555,0.43071447307585559,0.37733453523855265,0.42362783907949381,0.39098333591676648,0.35879512782965944,0.32572179864892764,0.3120229427930602,0.2606196888964511,0.26577258993075253,0.22719262442619789,0.20774452266974594,0.19021744668319987,0.19984499320747884,0.15260210761110038,0.16304952926767927,0.12291632378637379,0.13379755283014214,0.13314573283153514,0.12218932414899568,0.21956300413480642,0.27735050797464272,0.13740740740740739,0.11543818466353678,0.10759911894273128,0.12222173698596354,0.11489878970456106,0.13644927536231885,9.4820828667413218E-2,9.1609055501460562E-2,0.11373730838801674,0.1028138528138528,0.11727685613743132,9.2472832506496572E-2,9.0446051838456901E-2,8.9826839826839824E-2,9.5770932607215781E-2,9.6883116883116877E-2,8.0848377390930593E-2,8.523328523328523E-2,0.10497835497835498,8.9740584466322854E-2,8.8914276709738421E-2,9.8021071919377006E-2,0.34483306401539315]
[49,"Comoros","COM","Comoros","Comoros 2000","ESA","Eastern Africa","Sub-Saharan Africa","LOWER-MIDDLE INCOME","Full data, Source: MICS",null,"2000","Comoros",0.875,0.95945945945945943,0.95,0.94594594594594594,0.92523364485981308,0.93877551020408168,0.9,0.85897435897435892,0.94736842105263153,0.91666666666666663,0.7857142857142857,0.75,0.86764705882352944,0.69333333333333336,0.69230769230769229,0.70370370370370372,0.72413793103448276,0.59829059829059827,0.6785714285714286,0.58620689655172409,0.65217391304347827,0.59459459459459463,0.42592592592592593,0.46153846153846156,0.33962264150943394,0.22500000000000001,0.23076923076923078,0.24590163934426229,0.15441176470588236,0.24832214765100671,5.0847457627118647E-2,0.17241379310344829,0.14000000000000001,7.8431372549019607E-2,7.8947368421052627E-2,0.1111111111111111,2.5000000000000001E-2,9.2592592592592587E-2,0.10256410256410256,4.2553191489361701E-2,8.0745341614906832E-2,0.10191082802547771,9.4339622641509441E-2,7.1428571428571425E-2,0.14634146341463414,9.0909090909090912E-2,9.5238095238095233E-2,3.7037037037037035E-2,3.0303030303030304E-2,9.5238095238095233E-2,6.8181818181818177E-2,4.7619047619047616E-2,8.673469387755102E-2,8.4656084656084651E-2,4.0816326530612242E-2,9.8039215686274508E-2,2.7777777777777776E-2,0.12903225806451613,0.125,0,0.40065146579804561]
[50,"Congo","COG","Congo","Congo 2014-2015","WCA","Middle Africa","Sub-Saharan Africa","LOWER-MIDDLE INCOME","Full data, Source: MICS",null,"2014-2015","Congo",1,0.99371069182389937,1,0.994413407821229,0.98787878787878791,0.98255813953488369,0.9623655913978495,0.98809523809523814,0.97752808988764039,0.95209580838323349,0.94927536231884058,0.94029850746268662,0.82758620689655171,0.8110236220472441,0.70469798657718119,0.64462809917355368,0.5419847328244275,0.51908396946564883,0.36301369863013699,0.28767123287671231,0.27814569536423839,0.19480519480519481,0.15322580645161291,0.16296296296296298,9.5588235294117641E-2,6.7669172932330823E-2,3.3112582781456956E-2,3.1746031746031744E-2,3.1007751937984496E-2,3.5971223021582732E-2,5.1948051948051951E-2,4.0540540540540543E-2,2.7972027972027972E-2,3.9473684210526314E-2,2.8985507246376812E-2,9.9236641221374045E-2,7.8431372549019607E-2,0.50514677849790313]
[51,"Cook Island","COK",null,null,"OC",null,null,null,"No data",null,null,"Cook Island"]
[52,"Costa Rica","CRI","Costa Rica","CostaRica2018","LAC","Central America","Latin America and the Caribbean","UPPER-MIDDLE-INCOME","Full data, Source: MICS",null,"2018","Costa Rica",1,0.92592592592592593,0.87179487179487181,0.93333333333333335,0.88405797101449279,0.76363636363636367,0.81538461538461537,0.78181818181818186,0.82222222222222219,0.68888888888888888,0.64150943396226412,0.72916666666666663,0.67164179104477617,0.69230769230769229,0.58823529411764708,0.62295081967213117,0.532258064516129,0.61290322580645162,0.52459016393442626,0.52173913043478259,0.39622641509433965,0.46774193548387094,0.39655172413793105,0.375,0.33898305084745761,0.32142857142857145,0.20408163265306123,0.28301886792452829,0.21875,0.21875,0.13846153846153847,0.21794871794871795,0.18032786885245902,0.1,0.2,0.109375,null,0.49847870182555781]
[53,"Côte d'Ivoire","CIV","Côte d'Ivoire","Cote d'Ivoire 2006","WCA","Western Africa","Sub-Saharan Africa","LOWER-MIDDLE INCOME","Full data, Source: MICS",null,"2006","Côte d'Ivoire",0.96103896103896103,0.99444444444444446,0.97652582159624413,1,0.97122302158273377,0.98930481283422456,0.95731707317073167,0.96842105263157896,0.95302013422818788,0.99404761904761907,0.96794871794871795,0.90506329113924056,0.86524822695035464,0.85310734463276838,0.88073394495412849,0.91275167785234901,0.88095238095238093,0.66249999999999998,0.76027397260273977,0.6,0.61363636363636365,0.34615384615384615,0.30357142857142855,0.25,0.1891891891891892,8.6956521739130432E-2,0.17333333333333334,7.1428571428571425E-2,8.9041095890410954E-2,8.5714285714285715E-2,8.3916083916083919E-2,8.1081081081081086E-2,8.6956521739130432E-2,5.7142857142857141E-2,5.3571428571428568E-2,2.8301886792452831E-2,2.6086956521739129E-2,2.7397260273972601E-2,2.7777777777777776E-2,4.0697674418604654E-2,1.1627906976744186E-2,5.3435114503816793E-2,1.8987341772151899E-2,1.4285714285714285E-2,1.4598540145985401E-2,0,1.5625E-2,2.1739130434782608E-2,3.7313432835820892E-2,3.007518796992481E-2,2.7972027972027972E-2,1.9607843137254902E-2,2.1505376344086023E-2,6.8027210884353739E-3,0,2.4096385542168676E-2,0,0,0,0,0.38571428571428573]
[54,"Croatia","HRV",null,null,"EECA",null,null,"HIGH-INCOME","No data, regional estimates only ",null,null,"Croatia",0.93828584114298408,0.90657401452143127,0.83831720583392833,0.80420356106076651,0.77999394700293279,0.76443069456325852,0.70672871215328759,0.68961199933900774,0.62536857525868517,0.60938787136702033,0.60137389394221374,0.53710596548614575,0.52341398552885865,0.46742037748054144,0.44345693393535801,0.39802916505826469,0.36542293910910273,0.36232258041131965,0.26973416153197244,0.21047711134045732,0.27808811392384852,0.23240677002510496,0.22150380092280775,0.17985622462867853,0.14965769640194215,0.15033487492923706,0.1144601027500243,9.3838548461894003E-2,0.10948571262991005,0.1160557380279478,0.10150246346146531,8.6729063616801452E-2,7.6540313401296092E-2,6.7017598305179255E-2,5.9606153024554742E-2,6.4928303916183511E-2,0.1003838808250573]
[55,"Cuba","CUB","Cuba","Cuba 2019","LAC","Caribbean","Latin America and the Caribbean","UPPER-MIDDLE-INCOME","Full data, Source: MICS",null,"2019","Cuba",1,1,0.93548387096774188,0.95238095238095233,0.8214285714285714,0.76666666666666672,0.71604938271604934,0.5670103092783505,0.63749999999999996,0.54455445544554459,0.52112676056338025,0.43835616438356162,0.37037037037037035,0.35526315789473684,0.30188679245283018,0.32608695652173914,0.19491525423728814,0.23333333333333334,0.28000000000000003,0.24,0.16666666666666666,0.25316455696202533,0.21249999999999999,0.1388888888888889,0.14285714285714285,0.1111111111111111,0.13114754098360656,9.5890410958904104E-2,0.11494252873563218,0.15476190476190477,7.7586206896551727E-2,0.06,2.197802197802198E-2,0.10465116279069768,8.5714285714285715E-2,6.5573770491803282E-2]
[56,"Curaçao","CUW",null,null,null,null,null,"HIGH-INCOME","No data",null,null,"Curaçao"]
[57,"Cyprus","CYP",null,null,"WE",null,null,"HIGH-INCOME","No data",null,null,"Cyprus"]
[58,"Czechia","CZE",null,null,"WE",null,null,"HIGH-INCOME","Partial data: Source: Health records",null,"2005","Czechia",0.96,null,null,null,null,0.42,null,null,null,null,null,0.16]
[59,"Dem. People's Republic of Korea","PRK",null,null,"EA",null,null,"LOW-INCOME","No data",null,null,"Dem. People's Republic of Korea"]
[60,"Democratic Republic of the Congo","COD","Democratic Republic of the Congo","DRC2017_18","WCA","Middle Africa","Sub-Saharan Africa","LOW-INCOME","Full data, Source: MICS",null,"2017-18","Democratic Republic of the Congo",1,0.99,0.99,1,0.99,0.99,0.99,0.99,0.98,0.98,0.98,0.97,0.93,0.9,0.9,0.83,0.78,0.75,0.72,0.68,0.62,0.57999999999999996,0.54,0.49,0.26,0.2,0.16,0.2,0.16,0.09,7.0000000000000007E-2,0.06,0.08,0.09,0.09,0.09,0.05,0,0.64]
[61,"Denmark","DNK",null,null,"WE",null,null,"HIGH-INCOME","Partial data: Source: Health records",null,"2013","Denmark",null,null,null,null,null,0.13,null,null,null,null,null,0.03]
[62,"Djibouti","DJI","Djibouti","Djibouti 2006","ESA","Eastern Africa","Sub-Saharan Africa","LOWER-MIDDLE INCOME","Full data, Source: MICS",null,"2006","Djibouti",0.92307692307692313,0.90909090909090906,0.9285714285714286,0.80769230769230771,0.83870967741935487,0.80555555555555558,0.8,0.83333333333333337,0.88,0.76923076923076927,0.65714285714285714,0.66666666666666663,0.61538461538461542,0.5714285714285714,0.64150943396226412,0.54545454545454541,0.54838709677419351,0.52777777777777779,0.27586206896551724,0.375,0.27586206896551724,0.30769230769230771,8.3333333333333329E-2,6.25E-2,0.1111111111111111,0.21276595744680851,0.14583333333333334,0.13333333333333333,4.1666666666666664E-2,0.15555555555555556,0.18421052631578946,7.8947368421052627E-2,0.14285714285714285,0.08,0.10526315789473684,0.15,0,3.4482758620689655E-2,6.5217391304347824E-2,0,5.6603773584905662E-2,1.8867924528301886E-2,5.8823529411764705E-2,5.2631578947368418E-2,0,0,3.2258064516129031E-2,0,6.6666666666666666E-2,2.0833333333333332E-2,2.0408163265306121E-2,3.2786885245901641E-2,1.9607843137254902E-2,6.25E-2,6.0606060606060608E-2,0,0,0.125,0.2,0.125,0.27356210729821168]
[63,"Dominica","DMA",null,null,"LAC",null,null,"UPPER-MIDDLE-INCOME",null,null,null,"Dominica",0.98404898070219449,0.95114981845932112,0.91419125081647223,0.89928898699090765,0.82955802847107174,0.80853841756577227,0.76929757681852406,0.66910043507624073,0.6956451462085389,0.68418395249350406,0.63900699390709026,0.63847983592903501,0.55595417591809237,0.52340583884260383,0.52681197053092432,0.48175836710521525,0.4310656803179555,0.43071447307585559,0.37733453523855265,0.42362783907949381,0.39098333591676648,0.35879512782965944,0.32572179864892764,0.3120229427930602,0.2606196888964511,0.26577258993075253,0.22719262442619789,0.20774452266974594,0.19021744668319987,0.19984499320747884,0.15260210761110038,0.16304952926767927,0.12291632378637379,0.13379755283014214,0.13314573283153514,0.12218932414899568,0.21956300413480642,0.27735050797464272,0.13740740740740739,0.11543818466353678,0.10759911894273128,0.12222173698596354,0.11489878970456106,0.13644927536231885,9.4820828667413218E-2,9.1609055501460562E-2,0.11373730838801674,0.1028138528138528,0.11727685613743132,9.2472832506496572E-2,9.0446051838456901E-2,8.9826839826839824E-2,9.5770932607215781E-2,9.6883116883116877E-2,8.0848377390930593E-2,8.523328523328523E-2,0.10497835497835498,8.9740584466322854E-2,8.8914276709738421E-2,9.8021071919377006E-2,0.34483306401539315]
[64,"Dominican Republic","DOM","Dominican Republic","MICS-DomRep 2019","LAC","Caribbean","Latin America and the Caribbean","UPPER-MIDDLE-INCOME","Full data, Source: MICS",null,"2019","Dominican Republic",0.97520661157024791,0.91803278688524592,0.83941605839416056,0.73913043478260865,0.62698412698412698,0.67256637168141598,0.5859375,0.51968503937007871,0.48120300751879697,0.44285714285714284,0.42537313432835822,0.44086021505376344,0.3716216216216216,0.3923076923076923,0.30303030303030304,0.32258064516129031,0.31538461538461537,0.27272727272727271,0.1391304347826087,0.1981981981981982,0.17460317460317459,0.15573770491803279,0.15517241379310345,0.13725490196078433,0.10429447852760736,6.1643835616438353E-2,5.4054054054054057E-2,0.10344827586206896,6.9565217391304349E-2,3.875968992248062E-2,4.4247787610619468E-2,6.9565217391304349E-2,0.05,4.5454545454545456E-2,2.9411764705882353E-2,3.2258064516129031E-2]
[65,"Ecuador","ECU",null,null,"LAC",null,null,"UPPER-MIDDLE-INCOME",null,null,null,"Ecuador",0.98404898070219449,0.95114981845932112,0.91419125081647223,0.89928898699090765,0.82955802847107174,0.80853841756577227,0.76929757681852406,0.66910043507624073,0.6956451462085389,0.68418395249350406,0.63900699390709026,0.63847983592903501,0.55595417591809237,0.52340583884260383,0.52681197053092432,0.48175836710521525,0.4310656803179555,0.43071447307585559,0.37733453523855265,0.42362783907949381,0.39098333591676648,0.35879512782965944,0.32572179864892764,0.3120229427930602,0.2606196888964511,0.26577258993075253,0.22719262442619789,0.20774452266974594,0.19021744668319987,0.19984499320747884,0.15260210761110038,0.16304952926767927,0.12291632378637379,0.13379755283014214,0.13314573283153514,0.12218932414899568,0.21956300413480642,0.27735050797464272,0.13740740740740739,0.11543818466353678,0.10759911894273128,0.12222173698596354,0.11489878970456106,0.13644927536231885,9.4820828667413218E-2,9.1609055501460562E-2,0.11373730838801674,0.1028138528138528,0.11727685613743132,9.2472832506496572E-2,9.0446051838456901E-2,8.9826839826839824E-2,9.5770932607215781E-2,9.6883116883116877E-2,8.0848377390930593E-2,8.523328523328523E-2,0.10497835497835498,8.9740584466322854E-2,8.8914276709738421E-2,9.8021071919377006E-2,0.34483306401539315]
[66,"Egypt","EGY",null,"Egypt (subnational) 2013-2014","MENA","Western Asia","Western Asia and Northern Africa","LOWER-MIDDLE INCOME","Full data, Source: MICS",null,"2013-14","Egypt",0.9821428571428571,0.98165137614678899,0.99115044247787609,0.98019801980198018,0.97916666666666663,0.96842105263157896,0.95876288659793818,0.98039215686274506,0.94252873563218387,0.93243243243243246,0.90109890109890112,0.95876288659793818,0.8571428571428571,0.86170212765957444,0.83116883116883122,0.84693877551020413,0.74,0.6785714285714286,0.50847457627118642,0.51162790697674421,0.29629629629629628,0.22340425531914893,0.12121212121212122,0.14285714285714285,0.125,1.7094017094017096E-2,3.2258064516129031E-2,2.8571428571428571E-2,6.5934065934065936E-2,1.5873015873015872E-2,3.0769230769230771E-2,3.1746031746031744E-2,1.3888888888888888E-2,1.4925373134328358E-2,2.7777777777777776E-2,4.5454545454545456E-2,0,0.54040242733950816]
[67,"El Salvador","SLV","El Salvador","El Salvador 2014","LAC","Central America","Latin America and the Caribbean","LOWER-MIDDLE INCOME","Full data, Source: MICS",null,"2014","El Salvador",0.97560975609756095,0.98780487804878048,0.97826086956521741,0.98058252427184467,0.92391304347826086,0.96875,0.9363636363636364,0.92982456140350878,0.90322580645161288,0.85039370078740162,0.91129032258064513,0.82962962962962961,0.86259541984732824,0.79816513761467889,0.75862068965517238,0.71794871794871795,0.77477477477477474,0.68181818181818177,0.68695652173913047,0.6776859504132231,0.61870503597122306,0.6692913385826772,0.52845528455284552,0.54263565891472865,0.41726618705035973,0.37795275590551181,0.33333333333333331,0.34306569343065696,0.27184466019417475,0.22522522522522523,0.26666666666666666,0.23387096774193547,0.15841584158415842,0.15,0.14285714285714285,0.15384615384615385,6.6666666666666666E-2,0.6032049748863908]
[68,"Equatorial Guinea","GNQ",null,null,"WCA",null,null,"UPPER-MIDDLE-INCOME","Full data, Source: MICS",null,"2000","Equatorial Guinea",1,0.98305084745762716,0.97560975609756095,0.98333333333333328,0.98571428571428577,0.953125,1,0.9375,0.95348837209302328,0.97777777777777775,0.93333333333333335,0.89189189189189189,0.86842105263157898,0.8,0.74193548387096775,0.66666666666666663,0.59183673469387754,0.61818181818181817,0.37209302325581395,0.20689655172413793,0.17647058823529413,0.12903225806451613,0.1,0,8.3333333333333329E-2,0,2.8571428571428571E-2,2.0408163265306121E-2,2.3255813953488372E-2,0.04,5.2631578947368418E-2,2.8571428571428571E-2,0,0,0,3.125E-2,2.2222222222222223E-2,0,0.02,3.6363636363636362E-2,1.7857142857142856E-2,0,2.3809523809523808E-2,0,0,7.407407407407407E-2,3.2258064516129031E-2,0.04,0,6.4516129032258063E-2,0,0,1.5873015873015872E-2,2.3255813953488372E-2,2.1276595744680851E-2,0,3.2258064516129031E-2,0,0,0.125]
[69,"Eritrea","ERI",null,null,"ESA",null,null,"LOW-INCOME","No data, regional estimates only ",null,null,"Eritrea",0.95982137377920507,0.96876808303407436,0.96219526204133765,0.96646952127221941,0.97108051909280546,0.96109624496137458,0.96002614933086527,0.96592836627594869,0.94418286644001692,0.957687314676128,0.94322329543778205,0.91624043386516119,0.89241984176102362,0.87513792093744125,0.85642403205826589,0.83965498793094595,0.82752678212104913,0.7786267781838887,0.74848287028976102,0.71766924265489163,0.7159571230446502,0.62788117354771156,0.57243245910857588,0.51786311444291155,0.46631557174796673,0.40570928425123631,0.42057924906520272,0.43181752437848242,0.33981381843800734,0.39437519945467808,0.40387040309515498,0.36326845480032527,0.39837995975512724,0.40002063984418301,0.37290583923868892,0.29121513980527891,0.42827143046657784,0.38069761966682714,0.36660567525808452,0.39455917228128179,0.38017630033067229,0.36928640841424237,0.38418274070330299,0.38236009237203283,0.4423084883825727,0.4050048024530582,0.42378450068866069,0.40865143628301526,0.40118656756656118,0.4205600264174893,0.43955151213247051,0.44214691357548502,0.41349834665470547,0.43154917954249389,0.42296672716739331,0.39300411595841062,0.40836605087743505,0.42338345062775307,0.40624306200885668,0.37688538688935685,0.58515084891624591]
[70,"Estonia","EST",null,null,"WE",null,null,"HIGH-INCOME","No data",null,null,"Estonia"]
[71,"Ethiopia","ETH","Ethiopia","DHS-Ethiopia 2019","ESA","Eastern Africa","Sub-Saharan Africa","LOW-INCOME","Full data, Source: DHS",null,"2019","Ethiopia",0.9509803921568627,0.93203883495145634,0.91860465116279066,0.9555555555555556,0.9555555555555556,0.95798319327731096,0.93877551020408168,0.9726027397260274,0.91397849462365588,0.94252873563218387,0.96296296296296291,0.85915492957746475,0.88235294117647056,0.78504672897196259,0.83157894736842108,0.85057471264367812,0.81818181818181823,0.78494623655913975,0.7415730337078652,0.74698795180722888,0.72727272727272729,0.66666666666666663,0.63076923076923075,0.64556962025316456,0.5,0.58620689655172409,0.59223300970873782,0.5,0.57843137254901966,0.55882352941176472,0.54255319148936165,0.37931034482758619,0.55405405405405406,0.50819672131147542,0.5074626865671642,0.43661971830985913,0.4609375,0.5730337078651685,0.47008547008547008,0.52475247524752477,0.4777777777777778,0.44210526315789472,0.52127659574468088,0.61818181818181817,0.70588235294117652,0.52500000000000002,0.69696969696969702,0.65,0.66326530612244894,0.66666666666666663,0.76119402985074625,0.66216216216216217,0.65789473684210531,0.63793103448275867,0.62686567164179108,0.56097560975609762,0.55882352941176472,0.75,0.67647058823529416,0.66666666666666663,0.69138906348208673]
[72,"Falkand Island","FLK",null,null,"LAC",null,null,"HIGH-INCOME","No data, regional estimates only ",null,null,"Falkand Island",0.97399999999999998,0.82657004830917868,0.65079365079365081,0.95833333333333337,0.7321428571428571,0.68085714285714283,0.41203703703703703,0.9,0.33333333333333331,0.39999999999999997,0.44716775599128544,0.33866666666666662,0.53174603174603174,0.56944444444444453,0.40740740740740738,0.50151515151515158,0.32234432234432231,0.1111111111111111,0.33333333333333331,0.42222222222222222,0.23333333333333331,0.30952380952380953,0.12698412698412698,0.23021442495126701,0.17063492063492061,0.11929824561403508,0.11428571428571428,0.15555555555555556,9.0909090909090898E-2,0.10416666666666667,0.10000000000000002,0.10256410256410257,0.17261904761904759,6.25E-2,0.15764895330112719,0.1396103896103896,7.6923076923076927E-2,4.6875E-2,2.1739130434782608E-2,8.6956521739130432E-2,0.16666666666666669,0,2.7777777777777776E-2,0,0.17142857142857143,0.1,6.8181818181818177E-2,0.06,2.7777777777777776E-2,0.05,4.7619047619047616E-2,0,0.02,0,0,4.5454545454545456E-2,8.3333333333333329E-2,0,0,0.05,0.25920313016642788]
[73,"Fiji","FJI",null,null,"OC",null,null,"UPPER-MIDDLE-INCOME","No data, regional estimates only ",null,null,"Fiji",0.98404898070219449,0.95114981845932112,0.91419125081647223,0.89928898699090765,0.82955802847107174,0.80853841756577227,0.76929757681852406,0.66910043507624073,0.6956451462085389,0.68418395249350406,0.63900699390709026,0.63847983592903501,0.55595417591809237,0.52340583884260383,0.52681197053092432,0.48175836710521525,0.4310656803179555,0.43071447307585559,0.37733453523855265,0.42362783907949381,0.39098333591676648,0.35879512782965944,0.32572179864892764,0.3120229427930602,0.2606196888964511,0.26577258993075253,0.22719262442619789,0.20774452266974594,0.19021744668319987,0.19984499320747884,0.15260210761110038,0.16304952926767927,0.12291632378637379,0.13379755283014214,0.13314573283153514,0.12218932414899568,0.21956300413480642,0.27735050797464272,0.13740740740740739,0.11543818466353678,0.10759911894273128,0.12222173698596354,0.11489878970456106,0.13644927536231885,9.4820828667413218E-2,9.1609055501460562E-2,0.11373730838801674,0.1028138528138528,0.11727685613743132,9.2472832506496572E-2,9.0446051838456901E-2,8.9826839826839824E-2,9.5770932607215781E-2,9.6883116883116877E-2,8.0848377390930593E-2,8.523328523328523E-2,0.10497835497835498,8.9740584466322854E-2,8.8914276709738421E-2,9.8021071919377006E-2,0.34483306401539315]
[74,"Finland","FIN",null,null,"WE",null,null,"HIGH-INCOME","Partial data, Source: National survey",null,"2010","Finland",0.92,null,null,null,null,0.57999999999999996,null,null,null,null,null,0.34]
[75,"France","FRA",null,null,"WE",null,null,"HIGH-INCOME","Partial data, Source: National survey",null,"2012-13","France",0.63,null,null,null,null,0.23,null,null,null,null,null,0.09]
[76,"French Guiana","GUF",null,null,null,null,null,null,"No data",null,null,"French Guiana"]
[77,"French Polynesia","PYF",null,null,"OC",null,null,"HIGH-INCOME","No data, regional estimates only ",null,null,"French Polynesia",0.75,0.88435897435897426,0.88039215686274508,0.63598290598290597,0.80325396825396833,0.72777777777777775,0.58601503759398499,0.74333333333333329,0.57055555555555559,0.47416666666666663,0.51052631578947372,0.49830808080808076,0.47809523809523807,0.3880952380952381,0.37685185185185183,0.1711111111111111,0.33238095238095239,0.3132244008714597,0.28222222222222221,0.13777777777777778,0.10176470588235294,0.22634920634920633,0.31966329966329965,0.26812865497076022]
[78,"Gabon","GAB","Gabon","DHS-Gabon 2012","WCA","Middle Africa","Sub-Saharan Africa","UPPER-MIDDLE-INCOME","Full data, Source: DHS",null,"2012","Gabon",0.97916666666666663,0.94366197183098588,0.97222222222222221,0.95121951219512191,0.8571428571428571,0.85227272727272729,0.80645161290322576,0.82954545454545459,0.79518072289156627,0.70512820512820518,0.75362318840579712,0.73417721518987344,0.60869565217391308,0.58108108108108103,0.59322033898305082,0.45454545454545453,0.375,0.25,0.2153846153846154,0.20338983050847459,0.1388888888888889,0.11320754716981132,0.13846153846153847,0.18421052631578946,0.18461538461538463,0.2537313432835821,0.31944444444444442,0.24,0.32307692307692309,0.33333333333333331,0.30645161290322581,0.38636363636363635,0.32727272727272727,0.28846153846153844,0.3235294117647059,0.26470588235294118,0.328125,0.33333333333333331,0.28846153846153844,0.45,0.33333333333333331,0.26470588235294118,0.24242424242424243,0.22448979591836735,0.24444444444444444,0.1864406779661017,0.33333333333333331,0.3392857142857143,0.26829268292682928,0.30769230769230771,0.45,0.29411764705882354,0.29268292682926828,0.36585365853658536,0.30612244897959184,0.27027027027027029,0.22857142857142856,0.31372549019607843,0.33898305084745761,0.25,0.44184752365052865]
[79,"Gambia","GMB","Gambia","DHS-Gambia 2019-2020","WCA","Western Africa","Sub-Saharan Africa","LOW-INCOME","Full data, Source: DHS",null,"2019-20","Gambia",0.97590361445783136,0.96551724137931039,0.99047619047619051,0.96202531645569622,0.97826086956521741,0.97872340425531912,1,1,0.9859154929577465,1,0.9850746268656716,0.97368421052631582,0.98765432098765427,0.98863636363636365,0.95,0.91566265060240959,0.90909090909090906,0.87012987012987009,0.88636363636363635,0.81818181818181823,0.61702127659574468,0.48,0.34722222222222221,0.30136986301369861,0.2537313432835821,0.17857142857142858,0.24050632911392406,0.28813559322033899,0.31034482758620691,0.31034482758620691,0.24390243902439024,0.2978723404255319,0.19230769230769232,0.33870967741935482,0.41935483870967744,0.39705882352941174,0.35064935064935066,0.43209876543209874,0.44,0.48780487804878048,0.55813953488372092,0.5357142857142857,0.34782608695652173,0.43859649122807015,0.62222222222222223,0.50980392156862742,0.5,0.44642857142857145,0.5,0.39622641509433965,0.34375,0.47887323943661969,0.37704918032786883,0.38461538461538464,0.4,0.38775510204081631,0.37037037037037035,0.27272727272727271,0.29090909090909089,0.38775510204081631,0.604150847886611]
[80,"Georgia","GEO","Georgia","Georgia 2018","EECA","Western Asia","Western Asia and Northern Africa","UPPER-MIDDLE-INCOME","Full data, Source: MICS",null,"2018","Georgia",1,0.9,0.83333333333333337,0.81578947368421051,0.74285714285714288,0.58139534883720934,0.6333333333333333,0.6875,0.59615384615384615,0.51851851851851849,0.56756756756756754,0.61290322580645162,0.38461538461538464,0.42424242424242425,0.43902439024390244,0.4,0.42857142857142855,0.3,0.31818181818181818,0.13793103448275862,0.41860465116279072,0.32258064516129031,0.31428571428571428,0.20689655172413793,0.1891891891891892,0.16666666666666666,0.10256410256410256,5.4054054054054057E-2,0.16129032258064516,0.15625,2.7027027027027029E-2,2.9411764705882353E-2,9.375E-2,2.2727272727272728E-2,7.3170731707317069E-2,0.14285714285714285,null,0.38154808444096949]
[81,"Germany","DEU",null,null,"WE",null,null,"HIGH-INCOME","Partial data, Source: National survey",null,"2009-12","Germany",0.82,null,null,null,null,0.5,null,null,null,null,null,0.23]
[82,"Ghana","GHA","Ghana","Ghana2017_18","WCA","Western Africa","Sub-Saharan Africa","LOWER-MIDDLE INCOME","Full data, Source: MICS",null,"2017-18","Ghana",0.99,0.99,0.99,0.99,1,0.99,1,0.98,0.99,0.99,0.97,0.98,0.95,0.95,0.9,0.86,0.81,0.72,0.66,0.68,0.49,0.45,0.44,0.38,0.3,0.17,0.17,0.09,0.06,0.06,0.08,0.02,0.06,0.03,0.02,0.02,0]
[83,"Gibraltar","GIB",null,null,"WE",null,null,"HIGH-INCOME","No data",null,null,"Gibraltar"]
[84,"GLOBAL",null,"GLOBAL","GLOBAL","GLOBAL",null,null,null,"Global Average",null,null,"GLOBAL",0.93880021233751998,0.94186711160860725,0.90407766605361173,0.89841644708234358,0.87850397717407203,0.78745861756306668,0.80065101175152098,0.82705956234838673,0.75722088710103563,0.74913849594229487,0.74115514543999494,0.64441942971315558,0.69241445176619787,0.66321945478344468,0.63135803905589427,0.59430614343577159,0.560414121897436,0.51695760843756211,0.47982244052158946,0.44370301319145194,0.40932809844294515,0.3866836037089767,0.34536354468981528,0.31522364301507788,0.27159655209164935,0.2489521680713753,0.23688804648487413,0.23202960195103081,0.21480308754297087,0.2166483915324561,0.20213381288946741,0.20260413442680617,0.19733618864971955,0.19127735114044561,0.19850426674126442,0.19035790458694918,0.21662285087266098,0.26118437827383362,0.20478214681699761,0.20509764606195546,0.20860442754926767,0.19332776049996303,0.19906702807583165,0.18816115519894941,0.21100042650779571,0.21117079248784409,0.20303046122227839,0.19028882506690106,0.19061266184702808,0.18800398438678065,0.18906408361034518,0.18652343391110843,0.18326477953733919,0.18138122124064876,0.18454523756604704,0.18463259997997755,0.18830763380181018,0.18590580155845915,0.17776512104101616,0.18566911668061134,0.39407885437697293]
[85,"Greece","GRC",null,null,"WE",null,null,"HIGH-INCOME","Partial data, Source: National survey",null,"2007-08","Greece",0.88,null,null,null,null,0.22,null,null,null,null,null,0.06]
[86,"Greenland","GRL",null,null,"WE",null,null,"HIGH-INCOME","No data",null,null,"Greenland"]
[87,"Grenada","GRD",null,null,"LAC",null,null,"UPPER-MIDDLE-INCOME","No data",null,null,"Grenada"]
[88,"Guadeloupe","GLP",null,null,null,null,null,null,"No data",null,null,"Guadeloupe"]
[89,"Guam","GUM",null,null,"OC",null,null,"HIGH-INCOME","No data, regional estimates only ",null,null,"Guam",0.75,0.88435897435897426,0.88039215686274508,0.63598290598290597,0.80325396825396833,0.72777777777777775,0.58601503759398499,0.74333333333333329,0.57055555555555559,0.47416666666666663,0.51052631578947372,0.49830808080808076,0.47809523809523807,0.3880952380952381,0.37685185185185183,0.1711111111111111,0.33238095238095239,0.3132244008714597,0.28222222222222221,0.13777777777777778,0.10176470588235294,0.22634920634920633,0.31966329966329965,0.26812865497076022]
[90,"Guatemala","GTM","Guatemala","DHS-Guatemala 2014-2015","LAC","Central America","Latin America and the Caribbean","UPPER-MIDDLE-INCOME","Full data, Source: DHS",null,"2014-2015","Guatemala",0.98019801980198018,0.96097560975609753,0.96595744680851059,0.94009216589861755,0.95454545454545459,0.92380952380952386,0.93457943925233644,0.92788461538461542,0.90277777777777779,0.89898989898989901,0.89523809523809528,0.88043478260869568,0.88317757009345799,0.87142857142857144,0.83495145631067957,0.81463414634146336,0.8128654970760234,0.77659574468085102,0.78378378378378377,0.65641025641025641,0.69,0.63963963963963966,0.58910891089108908,0.51851851851851849,0.5,0.48499999999999999,0.45327102803738317,0.45454545454545453,0.48148148148148145,0.45622119815668205,0.43636363636363634,0.44497607655502391,0.4175257731958763,0.41414141414141414,0.43684210526315792,0.39898989898989901,0.37967914438502676,0.43925233644859812,0.42222222222222222,0.36619718309859156,0.33039647577092512,0.34010152284263961,0.35784313725490197,0.40579710144927539,0.3473684210526316,0.28999999999999998,0.35675675675675678,0.33333333333333331,0.36318407960199006,0.35784313725490197,0.32380952380952382,0.33333333333333331,0.36538461538461536,0.29499999999999998,0.30319148936170215,0.32275132275132273,0.34920634920634919,0.32098765432098764,0.32934131736526945,0.33513513513513515,0.56545728139107176]
[91,"Guinea","GIN","Guinea","Equatorial Guinea 2000","WCA","Western Africa","Sub-Saharan Africa","LOW-INCOME","Full data, Source: MICS",null,"2000","Guinea",1,0.98305084745762716,0.97560975609756095,0.98333333333333328,0.98571428571428577,0.953125,1,0.9375,0.95348837209302328,0.97777777777777775,0.93333333333333335,0.89189189189189189,0.86842105263157898,0.8,0.74193548387096775,0.66666666666666663,0.59183673469387754,0.61818181818181817,0.37209302325581395,0.20689655172413793,0.17647058823529413,0.12903225806451613,0.1,0,8.3333333333333329E-2,0,2.8571428571428571E-2,2.0408163265306121E-2,2.3255813953488372E-2,0.04,5.2631578947368418E-2,2.8571428571428571E-2,0,0,0,3.125E-2,2.2222222222222223E-2,0,0.02,3.6363636363636362E-2,1.7857142857142856E-2,0,2.3809523809523808E-2,0,0,7.407407407407407E-2,3.2258064516129031E-2,0.04,0,6.4516129032258063E-2,0,0,1.5873015873015872E-2,2.3255813953488372E-2,2.1276595744680851E-2,0,3.2258064516129031E-2,0,0,0.125,0.34684300341296931]
[92,"Guinea-Bissau","GNB","Guinea-Bissau","Guinea Bissau 2018-2019","WCA","Western Africa","Sub-Saharan Africa","LOW-INCOME","Full data, Source: MICS",null,"2018-19","Guinea-Bissau",0.97297297297297303,0.97692307692307689,1,0.98039215686274506,0.97115384615384615,1,0.99115044247787609,1,1,0.98540145985401462,0.9765625,1,0.96226415094339623,0.93442622950819676,0.95199999999999996,0.93442622950819676,0.90322580645161288,0.875,0.84848484848484851,0.76699029126213591,0.76521739130434785,0.76229508196721307,0.52142857142857146,0.38596491228070173,0.23333333333333334,0.16800000000000001,8.8709677419354843E-2,6.5040650406504072E-2,5.9523809523809521E-2,3.4090909090909088E-2,5.2083333333333336E-2,1.8518518518518517E-2,5.8333333333333334E-2,4.716981132075472E-2,4.1666666666666664E-2,4.3956043956043959E-2,0,0.63237815331863823]
[93,"Guyana","GUY","Guyana","MICS-Guyana 2019-2020","LAC","South America","Latin America and the Caribbean","UPPER-MIDDLE-INCOME","Full data, Source: MICS",null,"2019-20","Guyana",0.96296296296296291,0.97058823529411764,0.98039215686274506,0.94117647058823528,0.9642857142857143,0.91428571428571426,0.82499999999999996,0.78787878787878785,0.88372093023255816,0.73333333333333328,0.7678571428571429,0.6875,0.66666666666666663,0.71153846153846156,0.72916666666666663,0.66666666666666663,0.80487804878048785,0.61538461538461542,0.60416666666666663,0.51351351351351349,0.55555555555555558,0.65,0.45652173913043476,0.35135135135135137,0.41463414634146339,0.42857142857142855,0.23076923076923078,0.32258064516129031,0.375,0.28125,0.31707317073170732,0.27500000000000002,0.19047619047619047,0.22580645161290322,0.25,0.21875,0.60264439805149617]
[94,"Haiti","HTI","Haiti","DHS-Haiti 2016-2017","LAC","Caribbean","Latin America and the Caribbean","LOWER-MIDDLE INCOME","Full data, Source: DHS",null,"2016-17","Haiti",1,0.96907216494845361,0.96350364963503654,0.94166666666666665,0.95,0.97916666666666663,0.96153846153846156,0.93258426966292129,0.94318181818181823,0.88461538461538458,0.98230088495575218,0.85593220338983056,0.88888888888888884,0.875,0.75423728813559321,0.7415730337078652,0.65217391304347827,0.60869565217391308,0.39622641509433965,0.47191011235955055,0.35820895522388058,0.33333333333333331,0.32954545454545453,0.27160493827160492,0.13725490196078433,0.16842105263157894,0.14814814814814814,0.1388888888888889,0.13829787234042554,0.11764705882352941,0.20270270270270271,0.20454545454545456,0.21794871794871795,0.27884615384615385,0.30588235294117649,0.19626168224299065,0.23255813953488372,0.24271844660194175,0.38613861386138615,0.21428571428571427,0.27058823529411763,0.26315789473684209,0.2967032967032967,0.15942028985507245,0.23943661971830985,0.32876712328767121,0.34042553191489361,0.24,0.23404255319148937,0.10869565217391304,0.25,0.20430107526881722,0.22807017543859648,0.2391304347826087,0.20238095238095238,0.22972972972972974,0.2391304347826087,0.2391304347826087,0.22340425531914893,0.23711340206185566,0.45858976613328645]
[95,"Honduras","HND","Honduras","MICS-Honduras 2019","LAC","Central America","Latin America and the Caribbean","LOWER-MIDDLE INCOME","Full data, Source: MICS",null,"2019","Honduras",1,0.97413793103448276,0.93939393939393945,0.91200000000000003,0.93442622950819676,0.89655172413793105,0.8571428571428571,0.82568807339449546,0.82677165354330706,0.75,0.78333333333333333,0.74,0.78417266187050361,0.66666666666666663,0.71917808219178081,0.72027972027972031,0.61682242990654201,0.63793103448275867,0.578125,0.50406504065040647,0.49629629629629629,0.42,0.37209302325581395,0.35374149659863946,0.27737226277372262,0.23809523809523808,0.23809523809523808,0.1440677966101695,0.13636363636363635,0.1981981981981982,0.15454545454545454,0.171875,0.12605042016806722,4.6511627906976744E-2,6.3492063492063489E-2,0.10852713178294573,0.53953180212014129]
[96,"Hungary","HUN",null,null,"WE",null,null,"HIGH-INCOME","No data",null,null,"Hungary"]
[97,"Iceland","ISL",null,null,"WE",null,null,"HIGH-INCOME","No data",null,null,"Iceland"]
[98,"India","IND","India","India 2017","SA","Southern Asia","Central Asia and Southern Asia","LOWER-MIDDLE INCOME","Full data, Source: MICS",null,2017,"India",0.94991462720546382,0.96455964030679719,0.95417389150359178,0.95778611632270172,0.95149425287356326,0.94911454830755437,0.94695390317350014,0.94066237350505977,0.93625226860254085,0.92361597757533287,0.92085085332673755,0.91909640136590487,0.89372568093385218,0.88145180296959702,0.85429975429975435,0.85050654806029158,0.84166063239198652,0.82522610608653146,0.80835834680212426,0.79299516908212564,0.7687875150060024,0.76526857983811625,0.74451612903225806,0.72784810126582278,0.69552088575742321,0.65512265512265511,0.66232169208066893,0.63902321083172142,0.62438423645320196,0.6292134831460674,0.62914548535463566,0.60349784379492089,0.58776924981431045,0.59656117617742332,0.58852290272774066,0.591741935483871,0.56863657515123311,0.54261031986925057,0.51843370735058392,0.51330532212885149,0.51478720846357295,0.49905303030303028,0.51642335766423353,0.49388235294117649,0.50222118307224695,0.49418322830828892,0.4688039457459926,0.47644110275689222,0.46211031175059952,0.44050509956289463,0.44591097308488614,0.42223873204556711,0.42318400404960771,0.4384557533216345,0.42605973025048172,0.40776005712925495,0.40800191662673696,0.42028985507246375,0.40433031218529708,0.39860860602937387,0.4244683310217291]
[99,"Indonesia","IDN","Indonesia","DHS-Indonesia 2017","SEA","South-Eastern Asia","Eastern Asia and South-eastern Asia","LOWER-MIDDLE INCOME","Full data, Source: DHS",null,2017,"Indonesia",0.92655367231638419,0.90163934426229508,0.85517241379310349,0.85617977528089884,0.82627118644067798,0.80660377358490565,0.83193277310924374,0.73939393939393938,0.77272727272727271,0.75,0.70994475138121549,0.71755725190839692,0.7359550561797753,0.70940170940170943,0.67532467532467533,0.69957081545064381,0.65063291139240509,0.64347826086956517,0.62382445141065834,0.58407079646017701,0.58841463414634143,0.52710843373493976,0.49390243902439024,0.42249240121580545,0.32413793103448274,0.25316455696202533,0.27220630372492838,0.2443820224719101,0.20220588235294118,0.24806201550387597,0.14625850340136054,0.13108614232209737,0.15217391304347827,0.16494845360824742,0.14830508474576271,0.1092436974789916]
[100,"Iran (Islamic Republic of)","IRN",null,null,"MENA",null,null,"LOWER-MIDDLE INCOME","No data, regional estimates only ",null,null,"Iran (Islamic Republic of)",0.98406512605042018,0.95780762518147844,0.91893540936160745,0.90783770751361093,0.82529646581348504,0.87521815549728033,0.82260603761937801,0.81406533732995712,0.78232327059913265,0.76040084520937135,0.76301113189411063,0.74710496890196221,0.70508455718736085,0.64643911519611408,0.6154132904132904,0.59693902186659309,0.5137981111289619,0.46187850140056025,0.39259891851033524,0.33980861736512996,0.31684425311921188,0.21835897156830986,0.1972202127374541,0.17413105679162227,0.17002797943133696,0.10483395803163244,6.4114798083919469E-2,7.8925066904549507E-2,8.4436300133974546E-2,8.6921519140354064E-2,8.6596809357063986E-2,6.3768025344173154E-2,7.589110847552348E-2,6.1891218318496741E-2,7.2613549435838587E-2,9.5769164850770028E-2,4.5227995758218453E-2,0.39448957146161762,0.20689655172413793,0.17241379310344829,0.19230769230769232,0.16666666666666666,0.17117117117117117,0.24444444444444444,0.17592592592592593,0.1702127659574468,0.24074074074074073,0.24793388429752067,0.2578125,0.13978494623655913,0.24242424242424243,0.20792079207920791,0.22429906542056074,0.19387755102040816,0.20952380952380953,0.20833333333333334,0.15909090909090909,0.22077922077922077,0.19565217391304349,0.22448979591836735,0.34747061829330605]
[101,"Iraq","IRQ","Iraq","Iraq 2018","MENA","Western Asia","Western Asia and Northern Africa","UPPER-MIDDLE-INCOME","Full data, Source: MICS",null,"2018","Iraq",0.96296296296296291,0.90476190476190477,0.88235294117647056,0.82954545454545459,0.70397111913357402,0.70110701107011075,0.70188679245283014,0.65600000000000003,0.65182186234817818,0.58608058608058611,0.63184079601990051,0.68663594470046085,0.592741935483871,0.50813008130081305,0.48375451263537905,0.47058823529411764,0.4765625,0.42537313432835822,0.32954545454545453,0.35897435897435898,0.34024896265560167,0.32773109243697479,0.28828828828828829,0.24352331606217617,0.13247863247863248,0.10820895522388059,0.12878787878787878,0.10756972111553785,9.012875536480687E-2,7.8703703703703706E-2,9.7560975609756101E-2,9.6385542168674704E-2,6.569343065693431E-2,7.9831932773109238E-2,7.5892857142857137E-2,null,6.8027210884353748E-2]
[102,"Ireland","IRL",null,null,"WE",null,null,"HIGH-INCOME","Partial data: Source: National cohort",null,"2013","Ireland",0.55000000000000004,null,null,null,null,null,null,null,null,null,null,0.02]
[103,"Israel","ISR",null,null,"MENA",null,null,"HIGH-INCOME","No data, regional estimates only ",null,null,"Israel",0.89555555555555555,1,0.93548387096774188,0.91666666666666663,1,0.37393162393162394,0.75609756097560976,0.72727272727272729,0.65384615384615385,0.70731707317073167,0.61702127659574468,0.52333333333333332,0.52631578947368418,0.70967741935483875,0.63636363636363635,0.61538461538461542,0.57894736842105265,0.52380952380952384,0.375,0.21875,0.36363636363636365,0.34482758620689657,0.33333333333333331,0.13157894736842105,0.11764705882352941,0.13793103448275862,0.21621621621621623,0.16216216216216217,0.10256410256410256,0.12121212121212122,8.3333333333333329E-2,0.27272727272727271,5.2631578947368418E-2,0,0.08,7.8947368421052627E-2,6.6666666666666666E-2,5.4545454545454543E-2,5.7142857142857141E-2,6.6666666666666666E-2,0.05,0.10344827586206896,9.0909090909090912E-2,0,4.3478260869565216E-2,0.08,3.4482758620689655E-2,0,0,2.4390243902439025E-2,2.564102564102564E-2,7.1428571428571425E-2,8.8235294117647065E-2,3.0303030303030304E-2,4.5454545454545456E-2,0.05,3.7037037037037035E-2,0,0.1111111111111111,0,0.29205851619644724]
[104,"Italy","ITA",null,null,"WE",null,null,"HIGH-INCOME","Partial data, Source: National survey",null,"2013","Italy",0.86,null,null,null,null,0.46,null,null,null,null,null,0.19]
[105,"Jamaica","JAM","Jamaica","Jamaica 2011","LAC","Caribbean","Latin America and the Caribbean","UPPER-MIDDLE-INCOME","Full data, Source: MICS",null,"2011","Jamaica",1,0.96153846153846156,0.875,0.97142857142857142,0.8666666666666667,0.78260869565217395,0.82608695652173914,0.73913043478260865,0.75,0.73076923076923073,0.62068965517241381,0.6,0.40625,0.5,0.35294117647058826,0.40625,0.38709677419354838,0.37931034482758619,0.33333333333333331,0.46666666666666667,0.23529411764705882,0.45,0.25,0.32142857142857145,0.31034482758620691,0.22580645161290322,0.25806451612903225,0.1,0.20833333333333334,0.12121212121212122,0,0.14285714285714285,7.6923076923076927E-2,7.407407407407407E-2,0.11538461538461539,0.14814814814814814,3.4482758620689655E-2,0,7.407407407407407E-2,0.04,0,5.2631578947368418E-2,3.5714285714285712E-2,0.05,0,3.8461538461538464E-2,8.6956521739130432E-2,0,5.7142857142857141E-2,0,0,0,0,3.5714285714285712E-2,0,0,0,0,0,0.04,0.2786037491919845]
[106,"Japan","JPN",null,null,"EA",null,null,"HIGH-INCOME","Partial data, Source: National survey",null,"2009","Japan",0.95,null,null,null,null,0.63,null,null,null,null,null,0.6]
[107,"Jordan","JOR","Jordan","DHS-Jordan 2017-2018","MENA","Western Asia","Western Asia and Northern Africa","UPPER-MIDDLE-INCOME","Full data, Source: DHS",null,"2017-2018","Jordan",0.88571428571428568,0.88207547169811318,0.86124401913875603,0.74371859296482412,0.73366834170854267,0.69780219780219777,0.6428571428571429,0.62721893491124259,0.60919540229885061,0.55232558139534882,0.47183098591549294,0.42307692307692307,0.4,0.44295302013422821,0.3597560975609756,0.37267080745341613,0.31168831168831168,0.35810810810810811,0.29605263157894735,0.23780487804878048,0.27586206896551724,0.25287356321839083,0.21556886227544911,0.24666666666666667,0.16756756756756758,0.20987654320987653,0.21142857142857144,0.23333333333333334,0.25146198830409355,0.23255813953488372,0.18709677419354839,0.20754716981132076,0.22077922077922077,0.23076923076923078,0.20540540540540542,0.2,0.2608695652173913,0.25547445255474455,0.21666666666666667,0.2185430463576159,0.21153846153846154,0.17218543046357615,0.2792207792207792,0.20279720279720279,0.17266187050359713,0.19620253164556961,0.20261437908496732,0.21348314606741572,0.17543859649122806,0.21348314606741572,0.15609756097560976,0.25,0.23589743589743589,0.21951219512195122,0.22807017543859648,0.20689655172413793,0.2011173184357542,0.24390243902439024,0.18867924528301888,0.24193548387096775,0.33604309500489715]
[108,"Kazakhstan","KAZ","Kazakhstan","Kazak 2015","EECA","Central Asia","Central Asia and Southern Asia","UPPER-MIDDLE-INCOME","Full data, Source: MICS",null,"2015","Kazakhstan",1,0.95744680851063835,0.94505494505494503,0.95959595959595956,0.88636363636363635,0.93137254901960786,0.91578947368421049,0.88888888888888884,0.8571428571428571,0.84210526315789469,0.81052631578947365,0.71604938271604934,0.64772727272727271,0.67073170731707321,0.60576923076923073,0.44897959183673469,0.41836734693877553,0.45454545454545453,0.44186046511627908,0.43209876543209874,0.32051282051282054,0.24731182795698925,0.23333333333333334,0.19540229885057472,0.13793103448275862,7.8431372549019607E-2,0.18085106382978725,7.2916666666666671E-2,0.10752688172043011,6.1855670103092786E-2,6.5217391304347824E-2,6.1728395061728392E-2,0.11764705882352941,6.4935064935064929E-2,6.6666666666666666E-2,4.1666666666666664E-2,0,0.45947650583412175]
[109,"Kenya","KEN","Kenya","DHS-Kenya  2014","ESA","Eastern Africa","Sub-Saharan Africa","LOWER-MIDDLE INCOME","Full data, Source: DHS",null,"2014","Kenya",0.996,0.996,0.996,0.99299999999999999,0.99299999999999999,0.98399999999999999,0.98399999999999999,0.98399999999999999,0.98399999999999999,0.98399999999999999,0.98399999999999999,0.9,0.9,0.9,0.9,0.754,0.754,0.754,0.754,0.53100000000000003,0.53100000000000003,0.53100000000000003,0.53100000000000003,0.53100000000000003]
[110,"Kiribati","KIR","Kiribati","Kiri 2019","OC","Oceania","Oceania excluding Australia and New Zealand","LOWER-MIDDLE INCOME","Full data, Source: MICS",null,"2019","Kiribati",0.96969696969696972,1,1,0.96296296296296291,1,0.95121951219512191,1,0.95,0.96296296296296291,0.96153846153846156,1,0.84615384615384615,0.91176470588235292,0.94444444444444442,0.87096774193548387,0.8571428571428571,0.89743589743589747,0.8,0.92592592592592593,1,0.95238095238095233,0.84615384615384615,0.84,0.89473684210526316,0.8571428571428571,0.75862068965517238,0.89473684210526316,0.94736842105263153,0.9375,0.89655172413793105,0.83333333333333337,0.8666666666666667,0.82352941176470584,0.91666666666666663,0.83333333333333337,0.9]
[111,"Kuwait","KWT",null,null,"MENA",null,null,"HIGH-INCOME","No data, regional estimates only ",null,null,"Kuwait",0.89555555555555555,1,0.93548387096774188,0.91666666666666663,1,0.37393162393162394,0.75609756097560976,0.72727272727272729,0.65384615384615385,0.70731707317073167,0.61702127659574468,0.52333333333333332,0.52631578947368418,0.70967741935483875,0.63636363636363635,0.61538461538461542,0.57894736842105265,0.52380952380952384,0.375,0.21875,0.36363636363636365,0.34482758620689657,0.33333333333333331,0.13157894736842105,0.11764705882352941,0.13793103448275862,0.21621621621621623,0.16216216216216217,0.10256410256410256,0.12121212121212122,8.3333333333333329E-2,0.27272727272727271,5.2631578947368418E-2,0,0.08,7.8947368421052627E-2,6.6666666666666666E-2,5.4545454545454543E-2,5.7142857142857141E-2,6.6666666666666666E-2,0.05,0.10344827586206896,9.0909090909090912E-2,0,4.3478260869565216E-2,0.08,3.4482758620689655E-2,0,0,2.4390243902439025E-2,2.564102564102564E-2,7.1428571428571425E-2,8.8235294117647065E-2,3.0303030303030304E-2,4.5454545454545456E-2,0.05,3.7037037037037035E-2,0,0.1111111111111111,0,0.29205851619644724]
[112,"Kyrgyzstan","KGZ","Kyrgyzstan","Kyrgyz 2018","EECA","Central Asia","Central Asia and Southern Asia","LOWER-MIDDLE INCOME","Full data, Source: MICS",null,"2018","Kyrgyzstan",0.98076923076923073,1,0.98684210526315785,0.98484848484848486,0.97333333333333338,0.96363636363636362,0.96969696969696972,0.97826086956521741,0.9242424242424242,0.90566037735849059,0.88135593220338981,0.8035714285714286,0.78333333333333333,0.8,0.72463768115942029,0.79545454545454541,0.64864864864864868,0.45098039215686275,0.4,0.26,0.31034482758620691,0.33898305084745761,0.26190476190476192,6.8965517241379309E-2,9.6385542168674704E-2,0.17460317460317459,8.1967213114754092E-2,0.13043478260869565,3.2786885245901641E-2,1.7241379310344827E-2,1.9607843137254902E-2,3.9215686274509803E-2,0.05,1.8518518518518517E-2,0,1.8518518518518517E-2,null,0.50288461538461537]
[113,"Lao People's Democratic Republic","LAO","Lao People's Democratic Republic","Lao 2017","SEA","South-Eastern Asia","Eastern Asia and South-eastern Asia","LOWER-MIDDLE INCOME","Full data, Source: MICS",null,"2017","Lao People's Democratic Republic",0.97,0.93710691823899372,0.94021739130434778,0.91534391534391535,0.93264248704663211,0.90055248618784534,0.89795918367346939,0.88834951456310685,0.85026737967914434,0.88177339901477836,0.86187845303867405,0.84020618556701032,0.76502732240437155,0.70718232044198892,0.73410404624277459,0.57948717948717954,0.49006622516556292,0.39634146341463417,0.39473684210526316,0.36969696969696969,0.32142857142857145,0.36315789473684212,0.22702702702702704,0.21301775147928995,0.22500000000000001,0.18461538461538463,0.15819209039548024,0.12631578947368421,0.15544041450777202,0.18137254901960784,0.11666666666666667,0.13461538461538461,0.12105263157894737,8.8888888888888892E-2,7.6142131979695438E-2,2.0408163265306121E-2,7.1428571428571425E-2,0.50399036289715404,null,null,null,null,null,null,null,null,null,null,null,null,null,null,null,null,null,null,null,null,null,null,null,0]
[114,"Latvia","LVA",null,null,"WE",null,null,"HIGH-INCOME","No data",null,null,"Latvia"]
[115,"Lebanon","LBN",null,null,"MENA",null,null,"UPPER-MIDDLE-INCOME","No data, regional estimates only ",null,null,"Lebanon",0.92433862433862424,0.89341868823000903,0.8717984801576133,0.78663202375513941,0.7188197304210584,0.69945460443615426,0.67237196765498652,0.64160946745562131,0.6305086323235144,0.56920308373796746,0.5518358909676967,0.55485643388869199,0.49637096774193551,0.47554155071752063,0.42175530509817732,0.42162952137376686,0.39412540584415584,0.39174062121823316,0.31279904306220097,0.29838961851156975,0.30805551581055945,0.29030232782768284,0.25192857528186868,0.24509499136442142,0.15002310002310004,0.15904274921687855,0.1701082251082251,0.1704515272244356,0.1707953718344502,0.15563092161929371,0.14232887490165225,0.15196635598999775,0.14323632571807754,0.15530058177117001,0.14064913127413128,0.2,0.16444838805087253,0.25547445255474455,0.21666666666666667,0.2185430463576159,0.21153846153846154,0.17218543046357615,0.2792207792207792,0.20279720279720279,0.17266187050359713,0.19620253164556961,0.20261437908496732,0.21348314606741572,0.17543859649122806,0.21348314606741572,0.15609756097560976,0.25,0.23589743589743589,0.21951219512195122,0.22807017543859648,0.20689655172413793,0.2011173184357542,0.24390243902439024,0.18867924528301888,0.24193548387096775,0.33604309500489715]
[116,"Lesotho","LSO","Lesotho","Lesotho 2018","ESA","Southern Africa","Sub-Saharan Africa","LOWER-MIDDLE INCOME","Full data, Source: MICS",null,"2018","Lesotho",0.967741935483871,0.94736842105263153,0.96666666666666667,0.92307692307692313,0.94285714285714284,0.88571428571428568,0.77272727272727271,0.8867924528301887,0.88372093023255816,0.8571428571428571,0.76666666666666672,0.72,0.67307692307692313,0.6428571428571429,0.61904761904761907,0.58333333333333337,0.48,0.43396226415094341,0.39130434782608697,0.24489795918367346,0.14285714285714285,0.28125,0.14285714285714285,9.8039215686274508E-2,0.1276595744680851,0.1111111111111111,0,0.12,5.1724137931034482E-2,2.0408163265306121E-2,4.3478260869565216E-2,4.878048780487805E-2,1.5873015873015872E-2,1.2987012987012988E-2,1.4705882352941176E-2,0,null,0.40329670329670331]
[117,"Liberia","LBR","Liberia","DHS-Liberia 2019","WCA","Western Africa","Sub-Saharan Africa","LOW-INCOME","Full data, Source: DHS",null,"2019","Liberia",0.90804597701149425,0.91176470588235292,0.91379310344827591,0.96261682242990654,0.89795918367346939,0.89690721649484539,0.92436974789915971,0.91919191919191923,0.92173913043478262,0.91836734693877553,0.86170212765957444,0.92,0.81818181818181823,0.85263157894736841,0.84536082474226804,0.85057471264367812,0.78125,0.79611650485436891,0.61702127659574468,0.61111111111111116,0.5,0.48809523809523808,0.34343434343434343,0.352112676056338,0.32954545454545453,0.25757575757575757,0.22500000000000001,0.26666666666666666,0.21176470588235294,0.27956989247311825,0.24175824175824176,0.30097087378640774,0.27433628318584069,0.31182795698924731,0.27472527472527475,0.26190476190476192,0.39130434782608697,0.36363636363636365,0.32258064516129031,0.36,0.29591836734693877,0.31481481481481483,0.33333333333333331,0.38144329896907214,0.3125,0.2978723404255319,0.38144329896907214,0.27500000000000002,0.31182795698924731,0.36082474226804123,0.3595505617977528,0.37777777777777777,0.26605504587155965,0.35714285714285715,0.39560439560439559,0.38383838383838381,0.26804123711340205,0.4175824175824176,0.22680412371134021,0.29126213592233008,0.51122019635343618]
[118,"Libya","LBY",null,null,"MENA",null,null,"UPPER-MIDDLE-INCOME","No data, regional estimates only ",null,null,"Libya",0.92433862433862424,0.89341868823000903,0.8717984801576133,0.78663202375513941,0.7188197304210584,0.69945460443615426,0.67237196765498652,0.64160946745562131,0.6305086323235144,0.56920308373796746,0.5518358909676967,0.55485643388869199,0.49637096774193551,0.47554155071752063,0.42175530509817732,0.42162952137376686,0.39412540584415584,0.39174062121823316,0.31279904306220097,0.29838961851156975,0.30805551581055945,0.29030232782768284,0.25192857528186868,0.24509499136442142,0.15002310002310004,0.15904274921687855,0.1701082251082251,0.1704515272244356,0.1707953718344502,0.15563092161929371,0.14232887490165225,0.15196635598999775,0.14323632571807754,0.15530058177117001,0.14064913127413128,0.2,0.16444838805087253,0.25547445255474455,0.21666666666666667,0.2185430463576159,0.21153846153846154,0.17218543046357615,0.2792207792207792,0.20279720279720279,0.17266187050359713,0.19620253164556961,0.20261437908496732,0.21348314606741572,0.17543859649122806,0.21348314606741572,0.15609756097560976,0.25,0.23589743589743589,0.21951219512195122,0.22807017543859648,0.20689655172413793,0.2011173184357542,0.24390243902439024,0.18867924528301888,0.24193548387096775,0.33604309500489715]
[119,"Liechtenstein","LIE",null,null,"WE",null,null,"HIGH-INCOME","No data",null,null,"Liechtenstein"]
[120,"Lithuania","LTU",null,null,"WE",null,null,"HIGH-INCOME","No data",null,null,"Lithuania"]
[121,"Luxembourg","LUX",null,null,"WE",null,null,"HIGH-INCOME","No data",null,null,"Luxembourg"]
[122,"Madagascar","MDG","Madagascar","Madagascar 2018","ESA","Eastern Africa","Sub-Saharan Africa","LOW-INCOME","Full data, Source: MICS",null,"2018","Madagascar",0.99559471365638763,0.99521531100478466,0.99186991869918695,0.99586776859504134,1,0.99502487562189057,0.9907407407407407,0.99163179916317989,0.9776785714285714,0.99539170506912444,0.96721311475409832,0.98888888888888893,0.92156862745098034,0.95652173913043481,0.94017094017094016,0.84803921568627449,0.88362068965517238,0.79399141630901282,0.76442307692307687,0.76288659793814428,0.65625,0.71823204419889508,0.57777777777777772,0.50306748466257667,0.39705882352941174,0.31016042780748665,0.29629629629629628,0.2857142857142857,0.21022727272727273,0.22413793103448276,0.23152709359605911,0.1657142857142857,0.16250000000000001,0.18235294117647058,0.16352201257861634,0.10948905109489052,0.70248275862068965]
[123,"Malawi","MWI","Malawi","DHS-Malawi 2015-2016","ESA","Eastern Africa","Sub-Saharan Africa","LOW-INCOME","Full data, Source: DHS",null,"2015-16","Malawi",0.89552238805970152,0.88888888888888884,0.85858585858585856,0.93506493506493504,0.96907216494845361,0.92929292929292928,0.92452830188679247,0.92682926829268297,0.96551724137931039,0.92307692307692313,0.96875,0.90825688073394495,0.92035398230088494,0.91891891891891897,0.86206896551724133,0.90109890109890112,0.92473118279569888,0.88,0.85365853658536583,0.79268292682926833,0.86585365853658536,0.68571428571428572,0.66981132075471694,0.51851851851851849,0.41379310344827586,0.36363636363636365,0.2988505747126437,0.19753086419753085,0.14736842105263157,0.13043478260869565,0.22077922077922077,0.21978021978021978,0.20454545454545456,0.21348314606741572,0.26881720430107525,0.30120481927710846,0.26213592233009708,0.23364485981308411,0.23300970873786409,0.26923076923076922,0.27848101265822783,0.20370370370370369,0.23404255319148937,0.29113924050632911,0.29411764705882354,0.35632183908045978,0.27272727272727271,0.26190476190476192,0.33333333333333331,0.43877551020408162,0.41,0.38461538461538464,0.39473684210526316,0.32926829268292684,0.5,0.32098765432098764,0.37804878048780488,0.45205479452054792,0.40697674418604651,0.32098765432098764,0.53417533432392272]
[124,"Malaysia","MYS",null,null,"SEA",null,null,"UPPER-MIDDLE-INCOME","No data, regional estimates only ",null,null,"Malaysia",0.94874999999999998,0.82978723404255317,0.79844961240310075,0.78400000000000003,0.73015873015873012,0.50411764705882356,0.51515151515151514,0.50632911392405067,0.50724637681159424,0.43965517241379309,0.42922374429223742,0.26594017094017097,0.39408866995073893,0.27102803738317754,0.25738396624472576,0.27751196172248804,0.25870646766169153,0.25,0.23275862068965517,0.21333333333333335,0.17279411764705882,0.17509727626459143,0.1875,0.12916666666666668,0.1004566210045662,0.13168724279835392,9.3617021276595741E-2,8.0586080586080591E-2,7.1729957805907171E-2,9.2105263157894732E-2,7.3593073593073599E-2,4.8979591836734691E-2,6.8181818181818177E-2,9.3877551020408165E-2,7.0370370370370375E-2,5.2083333333333336E-2,0.25957222075521519]
[125,"Maldives","MDV","Maldives","DHS-Maldives 2016-2017","SA","Southern Asia","Central Asia and Southern Asia","UPPER-MIDDLE-INCOME","Full data, Source: DHS",null,"2016-17","Maldives",1,0.98039215686274506,0.96,1,0.89583333333333337,0.96153846153846156,0.88571428571428568,0.83673469387755106,0.875,0.83720930232558144,0.8392857142857143,0.9285714285714286,0.84745762711864403,0.78431372549019607,0.90740740740740744,0.84615384615384615,0.84615384615384615,0.78048780487804881,0.77083333333333337,0.66666666666666663,0.68627450980392157,0.70909090909090911,0.72,0.61818181818181817,0.67441860465116277,0.60416666666666663,0.52,0.50980392156862742,0.55102040816326525,0.5,0.45454545454545453,0.42857142857142855,0.46296296296296297,0.375,0.33962264150943394,0.39622641509433965,0.25,0.26229508196721313,0.1891891891891892,0.26415094339622641,0.25490196078431371,0.2982456140350877,0.18181818181818182,0.19672131147540983,0.22580645161290322,0.16363636363636364,0.18867924528301888,0.37777777777777777,0.2,0.13636363636363635,0.29310344827586204,0.2857142857142857,0.12195121951219512,0.23255813953488372,0.18333333333333332,0.23214285714285715,0.29411764705882354,0.234375,0.19354838709677419,0.10810810810810811,0.50947788493515134]
[126,"Mali","MLI","Mali","DHS-Mali 2018","WCA","Western Africa","Sub-Saharan Africa","LOW-INCOME","Full data, Source: DHS",null,"2018","Mali",0.95180722891566261,0.9707602339181286,0.93641618497109824,0.98639455782312924,0.9662921348314607,0.94674556213017746,0.98159509202453987,0.91463414634146345,0.94805194805194803,0.96273291925465843,0.95041322314049592,0.94039735099337751,0.90055248618784534,0.93103448275862066,0.84848484848484851,0.87804878048780488,0.85576923076923073,0.86813186813186816,0.7816091954022989,0.67901234567901236,0.73484848484848486,0.58156028368794321,0.53278688524590168,0.44067796610169491,0.33155080213903743,0.3724137931034483,0.43835616438356162,0.43169398907103823,0.34042553191489361,0.3776223776223776,0.51048951048951052,0.39072847682119205,0.38805970149253732,0.36170212765957449,0.37623762376237624,0.37383177570093457,0.53301886792452835,0.48148148148148145,0.52083333333333337,0.49044585987261147,0.48299319727891155,0.5,0.47368421052631576,0.54081632653061229,0.45038167938931295,0.46296296296296297,0.52222222222222225,0.53636363636363638,0.52873563218390807,0.48344370860927155,0.46323529411764708,0.42222222222222222,0.4642857142857143,0.47402597402597402,0.4689655172413793,0.52095808383233533,0.41447368421052633,0.40196078431372551,0.47945205479452052,0.58695652173913049,0.63089357880556807]
[127,"Malta","MLT",null,null,"WE",null,null,"HIGH-INCOME","No data",null,null,"Malta"]
[128,"Marshall Islands","MHL",null,null,"OC",null,null,"UPPER-MIDDLE-INCOME","No data, regional estimates only ",null,null,"Marshall Islands",0.75,0.96153846153846156,0.97058823529411764,0.60897435897435892,0.88988095238095233,0.85555555555555562,0.60902255639097747,0.875,0.64583333333333326,0.53125,0.61578947368421044,0.66161616161616155,0.60714285714285721,0.48214285714285715,0.46527777777777779,0.16666666666666666,0.42857142857142855,0.42483660130718959,0.3833333333333333,0.16666666666666666,0.11764705882352941,0.30952380952380953,0.4494949494949495,0.3771929824561403,0.28205128205128205,0.35,0.28030303030303028,0.14250000000000002,0.3345588235294118,0.14761904761904762,0.10416666666666667,0.10555555555555556,0.125,0.26250000000000001,0.32500000000000001,0.22916666666666666,0.46261759561291543]
[129,"Martinique","MTQ",null,null,null,null,null,null,"No data",null,null,"Martinique"]
[130,"Mauritania","MRT","Mauritania","Mauritania 2011","WCA","Western Africa","Sub-Saharan Africa","LOWER-MIDDLE INCOME","Full data, Source: MICS",null,"2011","Mauritania",1,0.97546012269938653,0.98675496688741726,0.98701298701298701,0.98192771084337349,0.9732620320855615,0.98192771084337349,0.9640718562874252,0.91463414634146345,0.92356687898089174,0.94047619047619047,0.97142857142857142,0.9042553191489362,0.85798816568047342,0.86184210526315785,0.81481481481481477,0.80821917808219179,0.75342465753424659,0.73076923076923073,0.55172413793103448,0.42857142857142855,0.37795275590551181,0.36974789915966388,0.31538461538461537,0.1069182389937107,0.10734463276836158,6.6666666666666666E-2,5.5555555555555552E-2,9.285714285714286E-2,7.2368421052631582E-2,9.0909090909090912E-2,0.04,3.4188034188034191E-2,4.4247787610619468E-2,3.5502958579881658E-2,3.7313432835820892E-2,6.7114093959731542E-3,3.3707865168539325E-2,1.9867549668874173E-2,6.6666666666666671E-3,3.4482758620689655E-2,0,3.5460992907801421E-2,7.2463768115942032E-2,3.2894736842105261E-2,3.3557046979865772E-2,2.5806451612903226E-2,1.9108280254777069E-2,1.2903225806451613E-2,2.2099447513812154E-2,3.3112582781456956E-2,0,1.2195121951219513E-2,7.575757575757576E-3,3.2786885245901641E-2,1.5267175572519083E-2,1.9607843137254902E-2,3.2786885245901641E-2,3.2894736842105261E-2,3.6363636363636362E-2,0.36306518568383261]
[131,"Mauritius","MUS",null,null,"ESA",null,null,"UPPER-MIDDLE-INCOME","No data, regional estimates only ",null,null,"Mauritius",0.92433862433862435,0.96495388669301718,0.86122357174988762,0.91690476190476178,0.85440613026819923,0.85312899106002549,0.78294723605938976,0.755944055944056,0.73566618566618569,0.73117283950617284,0.69375730090015819,0.61745920745920746,0.66604506604506608,0.59416445623342173,0.59283270755110562,0.59756842619745842,0.43181818181818182,0.50602869352869362,0.39467072155244193,0.31762115310383549,0.26127645502645502,0.25014245014245012,0.13673758865248228,0.12472733774360807,0.13896229739252994,0.13387533875338753,0.14601731601731602,0.10242424242424243,0.1218599033816425,0.16733746130030958,0.13409602400600149,0.10672210672210673,0.14469696969696969,0.10218230045816253,0.16732026143790849,0.16674710424710426,0.15190234340194242,0.10067567567567569,0.10528360528360529,9.8651960784313722E-2,9.5452273863068468E-2,0.12583095916429252,0.10493827160493825,0.10615384615384615,0.15242165242165243,0.15934065934065933,0.11029411764705882,0.08,0.16464646464646462,6.623931623931624E-2,6.850459482038429E-2,0.13039505466564963,0.19047619047619047,0.10101010101010099,0.17862951549392228,0.14102564102564105,7.9966329966329963E-2,0.15277777777777779,0.15320910973084886,0.14582161133885271,0.24870408846004857]
[132,"Mayotte","MYT",null,null,null,null,null,null,"No data",null,null,"Mayotte"]
[133,"Mexico","MEX","Mexico","Mex2015","LAC","Central America","Latin America and the Caribbean","UPPER-MIDDLE-INCOME","Full data, Source: MICS",null,"2015","Mexico",1,0.92592592592592593,0.85401459854014594,0.84873949579831931,0.82051282051282048,0.7967479674796748,0.76699029126213591,0.7661290322580645,0.69047619047619047,0.6495726495726496,0.5934959349593496,0.53383458646616544,0.54248366013071891,0.54471544715447151,0.50806451612903225,0.46938775510204084,0.46391752577319589,0.45600000000000002,0.33913043478260868,0.41322314049586778,0.41379310344827586,0.34146341463414637,0.26415094339622641,0.22302158273381295,0.25624999999999998,0.2,0.20833333333333334,0.22307692307692309,0.13385826771653545,0.15652173913043479,0.16101694915254236,0.13846153846153847,9.2436974789915971E-2,0.11320754716981132,6.1224489795918366E-2,0.104,8.3333333333333329E-2,0.42853881278538813]
[134,"Micronesia (Fed. States of)","FSM",null,null,"OC",null,null,"LOWER-MIDDLE INCOME","No data, regional estimates only ",null,null,"Micronesia (Fed. States of)",0.94696969696969702,0.9859154929577465,0.98124999999999996,0.94350679793717762,0.95714285714285707,0.92560975609756091,0.98351648351648358,0.95601265822784809,0.91819034224097518,0.96688034188034189,0.97272727272727266,0.86425339366515841,0.9010878323932312,0.88669590643274854,0.88163771712158812,0.81589537223340036,0.85460030165912526,0.79583333333333339,0.85732916014606153,0.85810810810810811,0.85678749111584929,0.76178660049627789,0.77606060606060612,0.76354489164086692,0.73262548262548255,0.70885579937304066,0.77663671373555843,0.77038750722961247,0.79414682539682535,0.68965517241379315,0.6875,0.71805555555555556,0.66934046345811049,0.71987179487179487,0.68095238095238098,0.6897260273972603]
[135,"Monaco","MCO",null,null,"WE",null,null,"HIGH-INCOME","No data",null,null,"Monaco"]
[136,"Mongolia","MNG","Mongolia","Mongol  2018","EA","Eastern Asia","Eastern Asia and South-eastern Asia","LOWER-MIDDLE INCOME","Full data, Source: MICS",null,"2018","Mongolia",0.98630136986301364,0.97169811320754718,0.97058823529411764,0.95798319327731096,0.9826086956521739,0.98936170212765961,0.9821428571428571,0.8867924528301887,0.87878787878787878,0.95604395604395609,0.92771084337349397,0.91208791208791207,0.84403669724770647,0.84507042253521125,0.85416666666666663,0.72413793103448276,0.70707070707070707,0.61764705882352944,0.70297029702970293,0.72826086956521741,0.50649350649350644,0.59090909090909094,0.54285714285714282,0.5376344086021505,0.46153846153846156,0.38372093023255816,0.44791666666666669,0.3888888888888889,0.37362637362637363,0.29292929292929293,0.33333333333333331,0.28125,0.25263157894736843,0.22448979591836735,0.22321428571428573,0.29113924050632911]
[137,"Montenegro","MNE","Montenegro","Monte 2018","EECA","Southern Europe","Northern America and Europe","UPPER-MIDDLE-INCOME","Full data, Source: MICS",null,"2018","Montenegro",0.90909090909090906,1,0.875,0.52941176470588236,0.77272727272727271,0.70588235294117652,0.5625,0.5,0.48,0.625,0.55555555555555558,0.6428571428571429,0.38461538461538464,0.5,0.25,0.38095238095238093,0.22222222222222221,0.35,8.3333333333333329E-2,0.25,6.25E-2,0.2,0.27272727272727271,0.1,0,6.6666666666666666E-2,0,0,0,6.25E-2,5.8823529411764705E-2,7.1428571428571425E-2,3.7037037037037035E-2,0,0,5.8823529411764705E-2,null,0.32075471698113206]
[138,"Montserrat","MSR",null,null,"LAC",null,null,null,"No data",null,null,"Montserrat"]
[139,"Morocco","MAR","Morocco","DHS-Morocco 2003-2004","MENA","Northern Africa","Western Asia and Northern Africa","LOWER-MIDDLE INCOME","Full data, Source: DHS",null,"2003-4","Morocco",0.96,0.93518518518518523,0.86792452830188682,0.90217391304347827,0.81443298969072164,0.86238532110091748,0.8303571428571429,0.78504672897196259,0.7142857142857143,0.78703703703703709,0.71111111111111114,0.69620253164556967,0.64761904761904765,0.59740259740259738,0.57407407407407407,0.45263157894736844,0.47727272727272729,0.4017857142857143,0.24545454545454545,0.23529411764705882,0.26213592233009708,0.18309859154929578,0.22222222222222221,0.17241379310344829,9.6491228070175433E-2,0.17460317460317459,9.4736842105263161E-2,0.15254237288135594,0.13333333333333333,0.15189873417721519,0.15053763440860216,0.14473684210526316,0.20481927710843373,0.14942528735632185,0.20481927710843373,0.15957446808510639,0.15652173913043479,0.17582417582417584,0.20689655172413793,0.17241379310344829,0.19230769230769232,0.16666666666666666,0.17117117117117117,0.24444444444444444,0.17592592592592593,0.1702127659574468,0.24074074074074073,0.24793388429752067,0.2578125,0.13978494623655913,0.24242424242424243,0.20792079207920791,0.22429906542056074,0.19387755102040816,0.20952380952380953,0.20833333333333334,0.15909090909090909,0.22077922077922077,0.19565217391304349,0.22448979591836735,0.34747061829330605]
[140,"Mozambique","MOZ","Mozambique","DHS-Mozambique 2011","ESA","Eastern Africa","Sub-Saharan Africa","LOW-INCOME","Full data, Source: DHS",null,"2011","Mozambique",0.94565217391304346,0.97209302325581393,0.9719101123595506,0.96019900497512434,0.97142857142857142,0.97044334975369462,0.97,0.96739130434782605,0.91584158415841588,0.914572864321608,0.92957746478873238,0.91443850267379678,0.89814814814814814,0.89949748743718594,0.88770053475935828,0.83606557377049184,0.82383419689119175,0.79611650485436891,0.74871794871794872,0.70186335403726707,0.66874999999999996,0.49032258064516127,0.40251572327044027,0.39873417721518989,0.36075949367088606,0.25903614457831325,0.29629629629629628,0.27647058823529413,0.28387096774193549,0.28654970760233917,0.27333333333333332,0.37062937062937062,0.3,0.34536082474226804,0.35606060606060608,0.3611111111111111,0.41333333333333333,0.44067796610169491,0.45714285714285713,0.43930635838150289,0.54605263157894735,0.51592356687898089,0.48,0.5,0.57971014492753625,0.47692307692307695,0.53503184713375795,0.53947368421052633,0.44827586206896552,0.50322580645161286,0.54887218045112784,0.48051948051948051,0.5,0.56874999999999998,0.41216216216216217,0.44094488188976377,0.44444444444444442,0.40769230769230769,0.3888888888888889,0.40517241379310343,0.61017293997965416]
[141,"Myanmar","MMR","Myanmar","DHS-Myanmar 2015-2016","SEA","South-Eastern Asia","Eastern Asia and South-eastern Asia","LOWER-MIDDLE INCOME","Full data, Source: DHS",null,"2015-2016","Myanmar",1,1,0.96666666666666667,0.97938144329896903,0.97752808988764039,0.9885057471264368,0.97402597402597402,0.94666666666666666,0.98666666666666669,0.96842105263157896,0.95238095238095233,0.96153846153846156,0.98630136986301364,0.91919191919191923,0.87654320987654322,0.80232558139534882,0.83561643835616439,0.83333333333333337,0.70129870129870131,0.77272727272727271,0.625,0.7,0.65277777777777779,0.64864864864864868,0.58823529411764708,0.57692307692307687,0.46753246753246752,0.60606060606060608,0.38157894736842107,0.48529411764705882,0.4358974358974359,0.36708860759493672,0.26760563380281688,0.45454545454545453,0.375,0.36986301369863012,0.38461538461538464,0.38202247191011235,0.36363636363636365,0.37096774193548387,0.37349397590361444,0.28985507246376813,0.39344262295081966,0.30985915492957744,0.27848101265822783,0.30526315789473685,0.26315789473684209,0.4044943820224719,0.30666666666666664,0.3707865168539326,0.44,0.34920634920634919,0.33750000000000002,0.31428571428571428,0.34246575342465752,0.29166666666666669,0.36842105263157893,0.34722222222222221,0.27536231884057971,0.37704918032786883,0.58307692307692305]
[142,"Namibia","NAM","Namibia","DHS-Namibia 2013","ESA","Southern Africa","Sub-Saharan Africa","UPPER-MIDDLE-INCOME","Full data, Source: DHS",null,"2013","Namibia",0.94444444444444442,0.98181818181818181,0.92307692307692313,1,0.89655172413793105,0.84444444444444444,0.80434782608695654,0.84090909090909094,0.88636363636363635,0.67500000000000004,0.84090909090909094,0.54545454545454541,0.8,0.65384615384615385,0.61764705882352944,0.5625,0.47727272727272729,0.61904761904761907,0.58064516129032262,0.4642857142857143,0.21875,0.4,0.24,0.17142857142857143,0.1875,0.26829268292682928,0.24,0.18181818181818182,0.16666666666666666,0.29411764705882354,0.25,0.24324324324324326,0.24242424242424243,0.20689655172413793,0.26666666666666666,0.1875,0.27586206896551724,0.23333333333333334,0.17948717948717949,0.25,0.21739130434782608,0.19230769230769232,0.16666666666666666,0.28000000000000003,0.34615384615384615,0.2857142857142857,0.20588235294117646,0.24,0.26666666666666666,0.11538461538461539,0.15789473684210525,0.15625,0.3125,0.27272727272727271,0.29166666666666669,0.30769230769230771,0.1111111111111111,0.25,0.2857142857142857,0.26923076923076922,0.45912596401028277]
[143,"Nauru","NRU",null,null,"OC",null,null,"HIGH-INCOME","No data, regional estimates only ",null,null,"Nauru",0.75,0.88435897435897426,0.88039215686274508,0.63598290598290597,0.80325396825396833,0.72777777777777775,0.58601503759398499,0.74333333333333329,0.57055555555555559,0.47416666666666663,0.51052631578947372,0.49830808080808076,0.47809523809523807,0.3880952380952381,0.37685185185185183,0.1711111111111111,0.33238095238095239,0.3132244008714597,0.28222222222222221,0.13777777777777778,0.10176470588235294,0.22634920634920633,0.31966329966329965,0.26812865497076022]
[144,"Nepal","NPL","Nepal","DHS-Nepal 2019","SA","Southern Asia","Central Asia and Southern Asia","LOWER-MIDDLE INCOME","Full data, Source: DHS",null,2019,"Nepal",0.98837209302325579,1,0.98780487804878048,0.97530864197530864,1,1,1,0.99,0.96202531645569622,0.97761194029850751,1,0.95238095238095233,0.98347107438016534,0.98019801980198018,0.98058252427184467,0.97916666666666663,0.96363636363636362,0.91954022988505746,0.99056603773584906,0.96226415094339623,0.95833333333333337,0.96031746031746035,0.94285714285714284,0.90909090909090906,0.90526315789473688,0.84403669724770647,0.87368421052631584,0.89583333333333337,0.7078651685393258,0.91176470588235292,0.75,0.7303370786516854,0.76249999999999996,0.73493975903614461,0.74545454545454548,0.76056338028169013,0.66666666666666663]
[145,"Netherlands","NLD",null,null,"WE",null,null,"HIGH-INCOME","Partial data, Source: National survey",null,"2006-08","Netherlands",null,null,null,null,null,0.32,null,null,null,null,null,0.11]
[146,"New Caledonia","NCL",null,null,"OC",null,null,"HIGH-INCOME","No data, regional estimates only ",null,null,"New Caledonia",0.75,0.88435897435897426,0.88039215686274508,0.63598290598290597,0.80325396825396833,0.72777777777777775,0.58601503759398499,0.74333333333333329,0.57055555555555559,0.47416666666666663,0.51052631578947372,0.49830808080808076,0.47809523809523807,0.3880952380952381,0.37685185185185183,0.1711111111111111,0.33238095238095239,0.3132244008714597,0.28222222222222221,0.13777777777777778,0.10176470588235294,0.22634920634920633,0.31966329966329965,0.26812865497076022]
[147,"New Zealand","NZL",null,null,"OC",null,null,"HIGH-INCOME","Partial data, Source: National survey",null,"2006","New Zealand",null,null,null,null,null,0.6,null,null,null,null,null,0.44]
[148,"Nicaragua","NIC",null,null,"LAC",null,null,"LOWER-MIDDLE INCOME","No data, regional estimates only ",null,null,"Nicaragua",0.98742964352720453,0.98385005362987277,0.95812598789884917,0.93260465075102539,0.94262023554967234,0.91958040150951348,0.89615949268123196,0.86941001450100064,0.87533797589951179,0.83793123570781769,0.85662417655767142,0.79082665231817761,0.83851667550662545,0.753892286782195,0.74749095583887382,0.70714555681339908,0.65841742011568782,0.6164959529752323,0.56412666673177347,0.52077837761821011,0.49875164653937587,0.46485949170674357,0.39438476554271823,0.33492975209032794,0.29466998688358392,0.29975095218360864,0.25856323123928759,0.25340960399107126,0.21073359452235291,0.21230766370085258,0.21244530244530244,0.22871537258008337,0.19774667753222852,0.19862032250808792,0.2015805109922757,0.16636042465946205,0.25636415810326174,0.3134930815564948,0.25861483207144248,0.22177822177822179,0.21644251717781127,0.20572263993316622,0.20973162639829304,0.15298447881568086,0.21100486712322866,0.22092461909813507,0.23707964301469339,0.18500782472613456,0.18225052776394127,0.12477355072463768,0.16159420289855073,0.19106498503720071,0.17390698969646337,0.17261137949543745,0.18232518232518233,0.17835774706003715,0.1558256304918407,0.16206667728406857,0.17333814160355812,0.19014891179839633,0.42673345801325957]
[149,"Niger","NER","Niger","DHS-Niger 2012","WCA","Western Africa","Sub-Saharan Africa","LOW-INCOME","Full data, Source: DHS",null,"2012","Niger",0.94827586206896552,1,0.9850746268656716,1,0.97499999999999998,0.98130841121495327,0.98230088495575218,0.98,0.97345132743362828,0.96078431372549022,0.970873786407767,0.98360655737704916,0.952755905511811,0.88034188034188032,0.9375,0.88596491228070173,0.82051282051282048,0.89830508474576276,0.80303030303030298,0.68965517241379315,0.63749999999999996,0.67123287671232879,0.52941176470588236,0.40845070422535212,0.32500000000000001,0.32653061224489793,0.37931034482758619,0.37068965517241381,0.37362637362637363,0.36,0.4,0.38461538461538464,0.51162790697674421,0.53731343283582089,0.34615384615384615,0.55223880597014929,0.50714285714285712,0.54597701149425293,0.58461538461538465,0.68141592920353977,0.53658536585365857,0.58208955223880599,0.57377049180327866,0.6376811594202898,0.57746478873239437,0.61956521739130432,0.62857142857142856,0.57333333333333336,0.51824817518248179,0.45652173913043476,0.46875,0.55238095238095242,0.37704918032786883,0.54,0.48333333333333334,0.45283018867924529,0.38805970149253732,0.54411764705882348,0.43859649122807015,0.52173913043478259,0.65225968436154946]
[150,"Nigeria","NGA","Nigeria","DHS-Nigeria 2018","WCA","Western Africa","Sub-Saharan Africa","LOWER-MIDDLE INCOME","Full data, Source: DHS",null,"2018","Nigeria",0.976303317535545,0.98484848484848486,0.97814207650273222,0.99038461538461542,0.98275862068965514,0.96380090497737558,0.96707818930041156,0.971830985915493,0.94954128440366969,0.96313364055299544,0.95294117647058818,0.93434343434343436,0.87916666666666665,0.84046692607003892,0.81553398058252424,0.69911504424778759,0.64573991031390132,0.56756756756756754,0.54625550660792954,0.42622950819672129,0.41269841269841268,0.25308641975308643,0.28658536585365851,0.19480519480519481,0.18859649122807018,0.20361990950226244,0.24242424242424243,0.24598930481283424,0.27979274611398963,0.28699551569506726,0.24,0.2864864864864865,0.32941176470588235,0.44303797468354428,0.35333333333333333,0.4351145038167939,0.45754716981132076,0.45771144278606968,0.41013824884792627,0.52450980392156865,0.45622119815668205,0.42790697674418604,0.41013824884792627,0.4891304347826087,0.48749999999999999,0.46835443037974683,0.35664335664335667,0.32061068702290074,0.43478260869565216,0.39,0.45871559633027525,0.37560975609756098,0.39898989898989901,0.36021505376344087,0.42857142857142855,0.41,0.36994219653179189,0.37349397590361444,0.31788079470198677,0.37704918032786883,0.54451469583048528]
[151,"Niue","NIU",null,null,"OC",null,null,null,"No data",null,null,"Niue"]
[152,"North Macedonia","MKD","North Macedonia","Nmace 2018_19","EECA","Southern Europe","Northern America and Europe",null,"Full data, Source: MICS",null,"2018-19","North Macedonia",1,0.78947368421052633,0.8,0.85,0.68421052631578949,0.88235294117647056,0.82352941176470584,0.61538461538461542,0.44444444444444442,0.47826086956521741,0.4,0.5,0.5161290322580645,0.45833333333333331,0.44444444444444442,0.34615384615384615,0.48275862068965519,0.33333333333333331,0.27586206896551724,5.5555555555555552E-2,0.375,0,0.21052631578947367,0.13333333333333333,0.3,0.26315789473684209,0.17391304347826086,4.3478260869565216E-2,3.8461538461538464E-2,4.3478260869565216E-2,0.22727272727272727,0,0,0,3.8461538461538464E-2,0.05,null,0.35546875]
[153,"Norfilk Island","NFK",null,null,null,null,null,"UPPER-MIDDLE-INCOME","No data",null,null,"Norfilk Island"]
[154,"Northern Mariana Island","MNP",null,null,"OC",null,null,"HIGH-INCOME","No data, regional estimates only ",null,null,"Northern Mariana Island",0.75,0.88435897435897426,0.88039215686274508,0.63598290598290597,0.80325396825396833,0.72777777777777775,0.58601503759398499,0.74333333333333329,0.57055555555555559,0.47416666666666663,0.51052631578947372,0.49830808080808076,0.47809523809523807,0.3880952380952381,0.37685185185185183,0.1711111111111111,0.33238095238095239,0.3132244008714597,0.28222222222222221,0.13777777777777778,0.10176470588235294,0.22634920634920633,0.31966329966329965,0.26812865497076022]
[155,"Norway","NOR",null,null,"WE",null,null,"HIGH-INCOME","Partial data, Source: National survey",null,"2018-2019","Norway",0.93,0.89,0.85,0.82,0.79,0.78,0.72,0.68,0.63,0.57999999999999996,0.51,0.48,0.34,0.28999999999999998,0.24,0.21,0.2,0.16,0.14000000000000001,0.12,0.11,0.1,0.09,0.08]
[156,"Oman","OMN",null,null,"MENA",null,null,"HIGH-INCOME","Partial data, Source: National survey",null,"2007-11","Oman",0.85,null,null,null,null,0.15,null,null,null,null,null,0.95]
[157,"Pakistan","PAK","Pakistan","DHS-Pakistan  2017-2018","SA","Southern Asia","Central Asia and Southern Asia","LOWER-MIDDLE INCOME","Full data, Source: DHS",null,"2017-18","Pakistan",0.9555555555555556,0.96296296296296291,0.92941176470588238,0.90909090909090906,0.93478260869565222,0.90140845070422537,0.8571428571428571,0.8783783783783784,0.80303030303030298,0.80392156862745101,0.81034482758620685,0.71621621621621623,0.78095238095238095,0.74025974025974028,0.79012345679012341,0.77027027027027029,0.64583333333333337,0.68478260869565222,0.67142857142857137,0.61538461538461542,0.61111111111111116,0.69811320754716977,0.54838709677419351,0.59183673469387754,0.43939393939393939,0.35443037974683544,0.29545454545454547,0.44871794871794873,0.52777777777777779,0.40384615384615385,0.4157303370786517,0.46153846153846156,0.39130434782608697,0.47457627118644069,0.41935483870967744,0.30645161290322581,0.41935483870967744,0.34177215189873417,0.40909090909090912,0.29850746268656714,0.32432432432432434,0.45121951219512196,0.37804878048780488,0.41333333333333333,0.46268656716417911,0.50617283950617287,0.29411764705882354,0.43636363636363634,0.28735632183908044,0.44927536231884058,0.42682926829268292,0.39130434782608697,0.28205128205128205,0.42708333333333331,0.42696629213483145,0.34782608695652173,0.42307692307692307,0.35820895522388058,0.41269841269841268,0.45454545454545453]
[158,"Palau","PLW",null,null,"OC",null,null,"HIGH-INCOME","No data, regional estimates only ",null,null,"Palau",0.75,0.88435897435897426,0.88039215686274508,0.63598290598290597,0.80325396825396833,0.72777777777777775,0.58601503759398499,0.74333333333333329,0.57055555555555559,0.47416666666666663,0.51052631578947372,0.49830808080808076,0.47809523809523807,0.3880952380952381,0.37685185185185183,0.1711111111111111,0.33238095238095239,0.3132244008714597,0.28222222222222221,0.13777777777777778,0.10176470588235294,0.22634920634920633,0.31966329966329965,0.26812865497076022]
[159,"Panama","PAN","Panama","Panama 2013","LAC","Central America","Latin America and the Caribbean","UPPER-MIDDLE-INCOME","Full data, Source: MICS",null,"2013","Panama",0.9838709677419355,0.95238095238095233,0.88372093023255816,0.85227272727272729,0.86868686868686873,0.82857142857142863,0.81052631578947365,0.81578947368421051,0.69473684210526321,0.68627450980392157,0.75257731958762886,0.71764705882352942,0.58823529411764708,0.76666666666666672,0.6,0.53921568627450978,0.44230769230769229,0.53846153846153844,0.48780487804878048,0.5,0.4,0.40229885057471265,0.330188679245283,0.31,0.26760563380281688,0.19277108433734941,0.25806451612903225,0.24390243902439024,0.12643678160919541,0.20408163265306123,0.17757009345794392,0.19148936170212766,0.16,0.13235294117647059,0.13793103448275862,9.0909090909090912E-2,0.12359550561797752,0.10101010101010101,5.3333333333333337E-2,5.5555555555555552E-2,0.1,9.6153846153846159E-2,6.6037735849056603E-2,0.09,3.1914893617021274E-2,3.7974683544303799E-2,1.1235955056179775E-2,7.792207792207792E-2,4.878048780487805E-2,1.2048192771084338E-2,3.7974683544303799E-2,2.5974025974025976E-2,1.7699115044247787E-2,5.6818181818181816E-2,2.0202020202020204E-2,1.8181818181818181E-2,7.0707070707070704E-2,3.7974683544303799E-2,2.6315789473684209E-2,1.6949152542372881E-2,0.32416011436740527]
[160,"Papua New Guinea","PNG","Papua New Guinea","DHS-Papua New Guinea  2016-2018","OC","Oceania","Oceania excluding Australia and New Zealand","LOWER-MIDDLE INCOME","Full data, Source: DHS",null,"2016-2018","Papua New Guinea",0.9242424242424242,0.971830985915493,0.96250000000000002,0.92405063291139244,0.91428571428571426,0.9,0.96703296703296704,0.96202531645569622,0.87341772151898733,0.97222222222222221,0.94545454545454544,0.88235294117647056,0.8904109589041096,0.82894736842105265,0.89230769230769236,0.77464788732394363,0.81176470588235294,0.79166666666666663,0.78873239436619713,0.71621621621621623,0.76119402985074625,0.67741935483870963,0.71212121212121215,0.63235294117647056,0.60810810810810811,0.65909090909090906,0.65853658536585369,0.59340659340659341,0.65079365079365081,0.48275862068965519,0.54166666666666663,0.56944444444444442,0.51515151515151514,0.52307692307692311,0.52857142857142858,0.47945205479452052,0.43835616438356162,0.5161290322580645,0.45238095238095238,0.44736842105263158,0.57971014492753625,0.55932203389830504,0.54411764705882348,0.47945205479452052,0.50793650793650791,0.50704225352112675,0.47692307692307695,0.53191489361702127,0.42857142857142855,0.53246753246753242,0.45238095238095238,0.40277777777777779,0.44262295081967212,0.47058823529411764,0.5,0.5,0.46835443037974683,0.44897959183673469,0.48333333333333334,0.45901639344262296,0.65241635687732347]
[161,"Paraguay","PRY","Paraguay","Paraguay 2016","LAC","South America","Latin America and the Caribbean","UPPER-MIDDLE-INCOME","Full data, Source: MICS",null,"2016","Paraguay",0.9285714285714286,1,0.92957746478873238,0.9850746268656716,0.86813186813186816,0.86956521739130432,0.90540540540540537,0.82258064516129037,0.87142857142857144,0.75,0.71212121212121215,0.72727272727272729,0.66265060240963858,0.52238805970149249,0.5662650602409639,0.45348837209302323,0.45454545454545453,0.31707317073170732,0.33783783783783783,0.30864197530864196,0.36585365853658536,0.21951219512195122,0.20689655172413793,0.21428571428571427,0.125,0.17543859649122806,0.10256410256410256,0.12658227848101267,0.14102564102564102,4.1666666666666664E-2,6.8493150684931503E-2,5.3333333333333337E-2,3.5294117647058823E-2,6.9444444444444448E-2,4.3478260869565216E-2,3.2258064516129031E-2,0,0.42959068719489296]
[162,"Peru","PER",null,null,"LAC",null,null,"UPPER-MIDDLE-INCOME","No data, regional estimates only ",null,null,"Peru",0.98404898070219449,0.95114981845932112,0.91419125081647223,0.89928898699090765,0.82955802847107174,0.80853841756577227,0.76929757681852406,0.66910043507624073,0.6956451462085389,0.68418395249350406,0.63900699390709026,0.63847983592903501,0.55595417591809237,0.52340583884260383,0.52681197053092432,0.48175836710521525,0.4310656803179555,0.43071447307585559,0.37733453523855265,0.42362783907949381,0.39098333591676648,0.35879512782965944,0.32572179864892764,0.3120229427930602,0.2606196888964511,0.26577258993075253,0.22719262442619789,0.20774452266974594,0.19021744668319987,0.19984499320747884,0.15260210761110038,0.16304952926767927,0.12291632378637379,0.13379755283014214,0.13314573283153514,0.12218932414899568,0.21956300413480642,0.27735050797464272,0.13740740740740739,0.11543818466353678,0.10759911894273128,0.12222173698596354,0.11489878970456106,0.13644927536231885,9.4820828667413218E-2,9.1609055501460562E-2,0.11373730838801674,0.1028138528138528,0.11727685613743132,9.2472832506496572E-2,9.0446051838456901E-2,8.9826839826839824E-2,9.5770932607215781E-2,9.6883116883116877E-2,8.0848377390930593E-2,8.523328523328523E-2,0.10497835497835498,8.9740584466322854E-2,8.8914276709738421E-2,9.8021071919377006E-2,0.34483306401539315]
[163,"Philippines","PHL","Philippines","Phils 2017","SEA","South-Eastern Asia","Eastern Asia and South-eastern Asia","LOWER-MIDDLE INCOME","Full data, Source: MICS",null,"2017","Philippines",0.9,0.94117647058823517,0.82352941176470584,0.82051282051282048,0.85795454545454541,0.79720279720279719,0.77439024390243905,0.80864197530864201,0.74545454545454548,0.75,0.74345549738219896,0.70270270270270274,0.69512195121951204,0.69736842105263153,0.5977653631284916,0.70059880239520955,0.68023255813953487,0.56204379562043794,0.70198675496688745,0.54644808743169404,0.52542372881355937,0.57608695652173914,0.54973821989528793,0.52121212121212124,0.45238095238095238,0.4585635359116022,0.46783625730994144,0.52747252747252749,0.47093023255813954,0.46478873239436619,0.55797101449275366,0.42567567567567566,0.44723618090452261,0.44571428571428567,0.48275862068965514,0.46629213483146065,0.38775510204081631,0.40804597701149425,0.46195652173913049,0.4943820224719101,0.41420118343195272,0.37125748502994005,0.45774647887323944,0.40935672514619881,0.36956521739130432,0.38118811881188125,0.45098039215686275,0.32994923857868019,0.35078534031413611,0.38728323699421963,0.38297872340425537,0.41714285714285715,0.37988826815642457,0.43712574850299402,0.42647058823529416,0.34104046242774566,0.31818181818181818,0.38647342995169082,0.34741784037558687,0.38860103626942999,0.52857549047483654]
[164,"Pitcarin","PCN",null,null,null,null,null,null,"No data",null,null,"Pitcarin"]
[165,"Poland","POL",null,null,"WE",null,null,"HIGH-INCOME","No data",null,null,"Poland"]
[166,"Portugal","PRT",null,null,"WE",null,null,"HIGH-INCOME","No data",null,null,"Portugal"]
[167,"Puerto Rico","PRI",null,null,"LAC",null,null,"HIGH-INCOME","No data, regional estimates only ",null,null,"Puerto Rico",0.97399999999999998,0.82657004830917868,0.65079365079365081,0.95833333333333337,0.7321428571428571,0.68085714285714283,0.41203703703703703,0.9,0.33333333333333331,0.39999999999999997,0.44716775599128544,0.33866666666666662,0.53174603174603174,0.56944444444444453,0.40740740740740738,0.50151515151515158,0.32234432234432231,0.1111111111111111,0.33333333333333331,0.42222222222222222,0.23333333333333331,0.30952380952380953,0.12698412698412698,0.23021442495126701,0.17063492063492061,0.11929824561403508,0.11428571428571428,0.15555555555555556,9.0909090909090898E-2,0.10416666666666667,0.10000000000000002,0.10256410256410257,0.17261904761904759,6.25E-2,0.15764895330112719,0.1396103896103896,7.6923076923076927E-2,4.6875E-2,2.1739130434782608E-2,8.6956521739130432E-2,0.16666666666666669,0,2.7777777777777776E-2,0,0.17142857142857143,0.1,6.8181818181818177E-2,0.06,2.7777777777777776E-2,0.05,4.7619047619047616E-2,0,0.02,0,0,4.5454545454545456E-2,8.3333333333333329E-2,0,0,0.05,0.25920313016642788]
[168,"Qatar","QAT","Qatar","Qatar 2012","MENA","Western Asia","Western Asia and Northern Africa","HIGH-INCOME","Full data, Source: MICS",null,"2012","Qatar",0.91666666666666663,1,0.93548387096774188,0.91666666666666663,1,0.87179487179487181,0.75609756097560976,0.72727272727272729,0.65384615384615385,0.70731707317073167,0.61702127659574468,0.6,0.52631578947368418,0.70967741935483875,0.63636363636363635,0.61538461538461542,0.57894736842105265,0.52380952380952384,0.375,0.21875,0.36363636363636365,0.34482758620689657,0.33333333333333331,0.13157894736842105,0.11764705882352941,0.13793103448275862,0.21621621621621623,0.16216216216216217,0.10256410256410256,0.12121212121212122,8.3333333333333329E-2,0.27272727272727271,5.2631578947368418E-2,0,0.08,7.8947368421052627E-2,6.6666666666666666E-2,5.4545454545454543E-2,5.7142857142857141E-2,6.6666666666666666E-2,0.05,0.10344827586206896,9.0909090909090912E-2,0,4.3478260869565216E-2,0.08,3.4482758620689655E-2,0,0,2.4390243902439025E-2,2.564102564102564E-2,7.1428571428571425E-2,8.8235294117647065E-2,3.0303030303030304E-2,4.5454545454545456E-2,0.05,3.7037037037037035E-2,0,0.1111111111111111,0,0.29205851619644724]
[169,"Republic of Korea","KOR",null,null,"EA",null,null,"HIGH-INCOME","Partial data, Source: National survey",null,"2012","Republic of Korea",0.88,null,null,null,null,0.61,null,null,null,null,null,0.46]
[170,"Republic of Moldova","MDA","Republic of Moldova","Moldova 2012","EECA","Eastern Europe","Northern America and Europe","UPPER-MIDDLE-INCOME","Full data, Source: MICS",null,"2012","Republic of Moldova",0.92307692307692313,0.96296296296296291,0.9,0.87878787878787878,0.84210526315789469,0.66666666666666663,0.58620689655172409,0.79069767441860461,0.77142857142857146,0.77777777777777779,0.48,0.59459459459459463,0.69565217391304346,0.55555555555555558,0.35714285714285715,0.34375,0.22857142857142856,0.20689655172413793,0.26315789473684209,0.1111111111111111,0.20833333333333334,0.125,4.3478260869565216E-2,0.125,7.407407407407407E-2,0,3.8461538461538464E-2,7.6923076923076927E-2,0,3.125E-2,0,3.4482758620689655E-2,0,0,0,0,0,0,3.125E-2,0,0,0,3.4482758620689655E-2,0,0,0,0,3.4482758620689655E-2,0,0,0,3.125E-2,0,0,0,2.7027027027027029E-2,0,0,0,0,0.22247317899491811]
[171,"Réunion","REU",null,null,"EECA",null,null,null,"No data",null,null,"Réunion"]
[172,"Romania","ROU",null,null,"EECA",null,null,"UPPER-MIDDLE-INCOME","No data, regional estimates only ",null,null,"Romania",0.93828584114298408,0.90657401452143127,0.83831720583392833,0.80420356106076651,0.77999394700293279,0.76443069456325852,0.70672871215328759,0.68961199933900774,0.62536857525868517,0.60938787136702033,0.60137389394221374,0.53710596548614575,0.52341398552885865,0.46742037748054144,0.44345693393535801,0.39802916505826469,0.36542293910910273,0.36232258041131965,0.26973416153197244,0.21047711134045732,0.27808811392384852,0.23240677002510496,0.22150380092280775,0.17985622462867853,0.14965769640194215,0.15033487492923706,0.1144601027500243,9.3838548461894003E-2,0.10948571262991005,0.1160557380279478,0.10150246346146531,8.6729063616801452E-2,7.6540313401296092E-2,6.7017598305179255E-2,5.9606153024554742E-2,6.4928303916183511E-2,0.1003838808250573]
[173,"Russian Federation","RUS",null,null,"EECA",null,null,"UPPER-MIDDLE-INCOME","Partial data: Source: Health records",null,"2013","Russian Federation",0.96,null,null,null,null,0.36,null,null,null,null,null,0.2]
[174,"Rwanda","RWA","Rwanda","DHS-Rwanda 2019-2020","ESA","Eastern Africa","Sub-Saharan Africa","LOW-INCOME","Full data, Source: DHS",null,"2019-20","Rwanda",1,1,1,0.98571428571428577,1,0.95161290322580649,0.98461538461538467,0.97368421052631582,0.98484848484848486,1,0.97435897435897434,0.9850746268656716,0.96610169491525422,0.97435897435897434,0.96052631578947367,0.94339622641509435,0.94666666666666666,0.92592592592592593,0.8666666666666667,0.84931506849315064,0.91304347826086951,0.828125,0.83076923076923082,0.7931034482758621,0.77777777777777779,0.58730158730158732,0.57692307692307687,0.74626865671641796,0.47499999999999998,0.41025641025641024,0.54838709677419351,0.36842105263157893,0.51898734177215189,0.53030303030303028,0.4,0.35384615384615387,0.37878787878787878,0.22222222222222221,0.40540540540540543,0.43333333333333335,0.41666666666666669,0.33962264150943394,0.43396226415094341,0.2857142857142857,0.5074626865671642,0.38596491228070173,0.35714285714285715,0.44642857142857145,0.35714285714285715,0.42857142857142855,0.45614035087719296,0.5,0.4098360655737705,0.51923076923076927,0.32835820895522388,0.47619047619047616,0.43939393939393939,0.37704918032786883,0.44897959183673469,0.38235294117647056,0.65087673383930911]
[175,"Saint Kitts and Nevis","KNA",null,null,"LAC",null,null,"HIGH-INCOME","No data, regional estimates only ",null,null,"Saint Kitts and Nevis",0.97399999999999998,0.82657004830917868,0.65079365079365081,0.95833333333333337,0.7321428571428571,0.68085714285714283,0.41203703703703703,0.9,0.33333333333333331,0.39999999999999997,0.44716775599128544,0.33866666666666662,0.53174603174603174,0.56944444444444453,0.40740740740740738,0.50151515151515158,0.32234432234432231,0.1111111111111111,0.33333333333333331,0.42222222222222222,0.23333333333333331,0.30952380952380953,0.12698412698412698,0.23021442495126701,0.17063492063492061,0.11929824561403508,0.11428571428571428,0.15555555555555556,9.0909090909090898E-2,0.10416666666666667,0.10000000000000002,0.10256410256410257,0.17261904761904759,6.25E-2,0.15764895330112719,0.1396103896103896,7.6923076923076927E-2,4.6875E-2,2.1739130434782608E-2,8.6956521739130432E-2,0.16666666666666669,0,2.7777777777777776E-2,0,0.17142857142857143,0.1,6.8181818181818177E-2,0.06,2.7777777777777776E-2,0.05,4.7619047619047616E-2,0,0.02,0,0,4.5454545454545456E-2,8.3333333333333329E-2,0,0,0.05,0.25920313016642788]
[176,"Saint Lucia","LCA","Saint Lucia","Sta Lucia 2012","LAC","Caribbean","Latin America and the Caribbean","UPPER-MIDDLE-INCOME","Full data, Source: MICS",null,"2012","Saint Lucia",1,1,1,1,0.7142857142857143,0.8,0.5,0,0.33333333333333331,0.88888888888888884,0.5,0.66666666666666663,0.5,0,0.5,0.2,0,0.14285714285714285,0,0.5,0.6,0,0.33333333333333331,0.5,0.14285714285714285,0.5,0.33333333333333331,0.2,0,0.33333333333333331,0,0,0,0,0,0,0,0,0,0,0,0,0,0,0,0,0,0,0,0,0,0,0,0,0,0,0,0,0,0,0.21111111111111111]
[177,"Saint Vincent and the Grenadines","VCT",null,null,"LAC",null,null,"UPPER-MIDDLE-INCOME",null,null,null,"Saint Vincent and the Grenadines",0.98404898070219449,0.95114981845932112,0.91419125081647223,0.89928898699090765,0.82955802847107174,0.80853841756577227,0.76929757681852406,0.66910043507624073,0.6956451462085389,0.68418395249350406,0.63900699390709026,0.63847983592903501,0.55595417591809237,0.52340583884260383,0.52681197053092432,0.48175836710521525,0.4310656803179555,0.43071447307585559,0.37733453523855265,0.42362783907949381,0.39098333591676648,0.35879512782965944,0.32572179864892764,0.3120229427930602,0.2606196888964511,0.26577258993075253,0.22719262442619789,0.20774452266974594,0.19021744668319987,0.19984499320747884,0.15260210761110038,0.16304952926767927,0.12291632378637379,0.13379755283014214,0.13314573283153514,0.12218932414899568,0.21956300413480642,0.27735050797464272,0.13740740740740739,0.11543818466353678,0.10759911894273128,0.12222173698596354,0.11489878970456106,0.13644927536231885,9.4820828667413218E-2,9.1609055501460562E-2,0.11373730838801674,0.1028138528138528,0.11727685613743132,9.2472832506496572E-2,9.0446051838456901E-2,8.9826839826839824E-2,9.5770932607215781E-2,9.6883116883116877E-2,8.0848377390930593E-2,8.523328523328523E-2,0.10497835497835498,8.9740584466322854E-2,8.8914276709738421E-2,9.8021071919377006E-2,0.34483306401539315]
[178,"Samoa","WSM",null,null,"OC",null,null,"LOWER-MIDDLE INCOME","No data, regional estimates only ",null,null,"Samoa",0.94696969696969702,0.9859154929577465,0.98124999999999996,0.94350679793717762,0.95714285714285707,0.92560975609756091,0.98351648351648358,0.95601265822784809,0.91819034224097518,0.96688034188034189,0.97272727272727266,0.86425339366515841,0.9010878323932312,0.88669590643274854,0.88163771712158812,0.81589537223340036,0.85460030165912526,0.79583333333333339,0.85732916014606153,0.85810810810810811,0.85678749111584929,0.76178660049627789,0.77606060606060612,0.76354489164086692,0.73262548262548255,0.70885579937304066,0.77663671373555843,0.77038750722961247,0.79414682539682535,0.68965517241379315,0.6875,0.71805555555555556,0.66934046345811049,0.71987179487179487,0.68095238095238098,0.6897260273972603]
[179,"San Marino","SMR",null,null,"WE",null,null,"HIGH-INCOME","No data",null,null,"San Marino"]
[180,"Sao Tome and Principe","STP","Sao Tome and Principe","Sao Tome & Principe 2019","WCA","Middle Africa","Sub-Saharan Africa","LOWER-MIDDLE INCOME","Full data, Source: MICS",null,"2019","Sao Tome and Principe",1,0.96551724137931039,1,0.95652173913043481,1,1,0.84,0.97142857142857142,1,1,0.96969696969696972,0.95833333333333337,0.91666666666666663,0.96153846153846156,0.64102564102564108,0.69230769230769229,0.61538461538461542,0.45714285714285713,0.35,0.3888888888888889,0.27777777777777779,0.05,0.10526315789473684,0.04,9.375E-2,9.0909090909090912E-2,2.5000000000000001E-2,7.6923076923076927E-2,2.8571428571428571E-2,0,3.7037037037037035E-2,0.10526315789473684,0,0,0,0,null,0.50256937307297023]
[181,"Saudi Arabia","SAU",null,null,"MENA",null,null,"HIGH-INCOME","Partial data, Source: National survey",null,"2004-05","Saudi Arabia",0.92,null,null,null,null,0.1,null,null,null,null,null,0.02]
[182,"Senegal","SEN","Senegal","DHS-Senegal 2019","WCA","Western Africa","Sub-Saharan Africa","LOWER-MIDDLE INCOME","Full data, Source: DHS",null,"2019","Senegal",0.95454545454545459,0.98969072164948457,1,0.99038461538461542,1,1,0.99159663865546221,0.99152542372881358,0.96581196581196582,1,0.99099099099099097,0.98936170212765961,0.98,0.98019801980198018,0.97402597402597402,0.96511627906976749,0.92982456140350878,0.88349514563106801,0.69166666666666665,0.65517241379310343,0.49557522123893805,0.46913580246913578,0.38271604938271603,0.26168224299065418,0.224,0.20175438596491227,0.15841584158415842,0.20202020202020202,0.14814814814814814,0.27368421052631581,0.24675324675324675,0.26506024096385544,0.32967032967032966,0.35483870967741937,0.3867924528301887,0.36082474226804123]
[183,"Serbia","SRB","Serbia","Serbia 2019","EECA","Southern Europe","Northern America and Europe","UPPER-MIDDLE-INCOME","Full data, Source: MICS",null,"2019","Serbia",1,0.94736842105263153,0.7,0.61538461538461542,0.68421052631578949,0.72727272727272729,0.5,0.5,0.4642857142857143,0.32142857142857145,0.5,0.41463414634146339,0.29166666666666669,0.22222222222222221,0.28205128205128205,0.24,0.21739130434782608,0.2608695652173913,8.6956521739130432E-2,8.5714285714285715E-2,7.1428571428571425E-2,7.6923076923076927E-2,0.14285714285714285,4.6511627906976744E-2,0.11538461538461539,0.10526315789473684,0.10810810810810811,5.128205128205128E-2,0.125,0.08,3.7037037037037035E-2,5.8823529411764705E-2,0,0.05,3.0303030303030304E-2,0,null,0.22782258064516128]
[184,"Seychelles","SYC",null,null,"ESA",null,null,"HIGH-INCOME","No data",null,null,"Seychelles"]
[185,"Sierra Leone","SLE","Sierra Leone","DHS-Sierra Leone 2019","WCA","Western Africa","Sub-Saharan Africa","LOW-INCOME","Full data, Source: DHS",null,"2019","Sierra Leone",0.96470588235294119,0.98095238095238091,0.98901098901098905,0.97499999999999998,0.96551724137931039,0.97777777777777775,0.95192307692307687,0.93617021276595747,0.95918367346938771,0.9838709677419355,0.93939393939393945,0.97959183673469385,0.90434782608695652,0.87254901960784315,0.89719626168224298,0.82795698924731187,0.75862068965517238,0.65277777777777779,0.57746478873239437,0.62295081967213117,0.34210526315789475,0.34848484848484851,0.25862068965517243,0.25862068965517243,0.2857142857142857,0.15662650602409639,0.20930232558139536,0.16470588235294117,0.21794871794871795,0.13235294117647059,0.171875,0.19402985074626866,0.26785714285714285,0.1864406779661017,0.30357142857142855,0.36206896551724138,0.32989690721649484,0.31395348837209303,0.3783783783783784,0.41666666666666669,0.37931034482758619,0.40579710144927539,0.4,0.25454545454545452,0.3235294117647059,0.48979591836734693,0.40677966101694918,0.28846153846153844,0.35227272727272729,0.31325301204819278,0.35164835164835168,0.30337078651685395,0.30158730158730157,0.45070422535211269,0.3235294117647059,0.3125,0.48979591836734693,0.40425531914893614,0.44230769230769229,0.30909090909090908]
[186,"Singapore","SGP",null,null,"SEA",null,null,"HIGH-INCOME","Partial data, Source: National survey",null,"2011","Singapore",0.96,null,null,null,null,0.42,null,null,null,null,null,0.19]
[187,"Slovakia","SVK",null,null,"WE",null,null,"HIGH-INCOME","No data",null,null,"Slovakia"]
[188,"Slovenia","SVN",null,null,"WE",null,null,"HIGH-INCOME","No data",null,null,"Slovenia"]
[189,"Solomon Islands","SLB",null,null,"OC",null,null,"LOWER-MIDDLE INCOME","No data, regional estimates only ",null,null,"Solomon Islands",0.94696969696969702,0.9859154929577465,0.98124999999999996,0.94350679793717762,0.95714285714285707,0.92560975609756091,0.98351648351648358,0.95601265822784809,0.91819034224097518,0.96688034188034189,0.97272727272727266,0.86425339366515841,0.9010878323932312,0.88669590643274854,0.88163771712158812,0.81589537223340036,0.85460030165912526,0.79583333333333339,0.85732916014606153,0.85810810810810811,0.85678749111584929,0.76178660049627789,0.77606060606060612,0.76354489164086692,0.73262548262548255,0.70885579937304066,0.77663671373555843,0.77038750722961247,0.79414682539682535,0.68965517241379315,0.6875,0.71805555555555556,0.66934046345811049,0.71987179487179487,0.68095238095238098,0.6897260273972603]
[190,"Somalia","SOM","Somalia","Somalia 2006","ESA","Eastern Africa","Sub-Saharan Africa","LOW-INCOME","Full data, Source: MICS",null,"2006","Somalia",0.96153846153846156,0.96296296296296291,0.95833333333333337,0.94117647058823528,0.95454545454545459,0.88800000000000001,0.87022900763358779,0.86390532544378695,0.8288288288288288,0.8970588235294118,0.77108433734939763,0.671875,0.60869565217391308,0.57777777777777772,0.5,0.47499999999999998,0.43269230769230771,0.43157894736842106,0.40277777777777779,0.37373737373737376,0.5,0.25925925925925924,0.25806451612903225,0.2558139534883721,8.3333333333333329E-2,0.18954248366013071,0.1,0.14814814814814814,0.13333333333333333,0.15841584158415842,0.14953271028037382,0.10869565217391304,6.7796610169491525E-2,0.1111111111111111,6.8181818181818177E-2,3.8461538461538464E-2,2.8985507246376812E-2,2.6845637583892617E-2,2.1505376344086023E-2,2.3952095808383235E-2,6.8493150684931503E-3,1.5151515151515152E-2,5.2083333333333336E-2,2.6548672566371681E-2,3.6363636363636362E-2,6.25E-2,3.6363636363636362E-2,0,0,2.1582733812949641E-2,2.072538860103627E-2,1.6216216216216217E-2,3.3333333333333333E-2,0,2.7522935779816515E-2,3.8834951456310676E-2,0,0,0,0,0.30188051256448661]
[191,"South Africa","ZAF","South Africa","DHS-South Africa  2016","ESA","Southern Africa","Sub-Saharan Africa","UPPER-MIDDLE-INCOME","Full data, Source: DHS",null,"2016","South Africa",0.82857142857142863,0.91304347826086951,0.73076923076923073,0.84,0.75,0.76666666666666672,0.68965517241379315,0.57692307692307687,0.47619047619047616,0.66666666666666663,0.44444444444444442,0.48,0.45454545454545453,0.57692307692307687,0.48,0.54838709677419351,0.4,0.4375,0.18518518518518517,0.21739130434782608,0.22222222222222221,0.22222222222222221,0,0.11764705882352941,0.13636363636363635,0.1,9.0909090909090912E-2,4.5454545454545456E-2,0.17391304347826086,0.15789473684210525,0.12903225806451613,7.6923076923076927E-2,0.16666666666666666,7.6923076923076927E-2,0.23529411764705882,0.2857142857142857,0.13333333333333333,4.1666666666666664E-2,0.13636363636363635,3.125E-2,6.8965517241379309E-2,0.18518518518518517,0.14814814814814814,3.8461538461538464E-2,0.1111111111111111,0.19230769230769232,0.125,0,0.22727272727272727,8.3333333333333329E-2,4.7619047619047616E-2,0.21739130434782608,0.23809523809523808,0,0.22727272727272727,0.11538461538461539,8.3333333333333329E-2,0.20833333333333334,0.17391304347826086,0.13793103448275862,0.28698630136986303]
[192,"South Sudan","SSD","South Sudan","South Sudan 2010","ESA","Eastern Africa","Sub-Saharan Africa","LOW-INCOME","Full data, Source: MICS",null,"2010","South Sudan",0.97709923664122134,0.98399999999999999,0.97560975609756095,0.9517241379310345,0.96923076923076923,0.99295774647887325,0.96453900709219853,0.99342105263157898,0.93913043478260871,0.98550724637681164,0.96850393700787396,0.97777777777777775,0.9375,0.93137254901960786,0.94021739130434778,0.86538461538461542,0.88888888888888884,0.78378378378378377,0.72839506172839508,0.77333333333333332,0.79032258064516125,0.73076923076923073,0.67346938775510201,0.67307692307692313,0.75,0.6,1,1,0.5,1,1,1,1,1,1,null,0.92291738679571378]
[193,"Spain","ESP",null,null,"WE",null,null,"HIGH-INCOME","Partial data, Source: National survey",null,null,"Spain",0.77,null,null,null,null,0.47,null,null,null,null,null,0.23]
[194,"Sri Lanka","LKA",null,null,"SA",null,null,"LOWER-MIDDLE INCOME","No data, regional estimates only ",null,null,"Sri Lanka",0.97527195166035141,0.98223916185168059,0.97015352772707186,0.96546977442733883,0.97558406312164259,0.96391983409060822,0.9531085339004759,0.9551027932338304,0.93041154353454503,0.93284800368147158,0.93829053526274198,0.90444961870537699,0.90959335308914591,0.89824136295506263,0.89993215858628484,0.88314528522305802,0.8622183563977982,0.83903353475284614,0.83792811881382223,0.81989429781569112,0.80166545441629344,0.79414659476606742,0.74959038160580937,0.73555319009532605,0.6528159114336447,0.59717914860923182,0.59564143896165533,0.60598762584932797,0.56630871781386405,0.60702451237713295,0.51257707278244324,0.52305367652069423,0.53260689793790494,0.51220194179921252,0.4975922825796939,0.44784833253891954,0.42385859136489296,0.32213556372079061,0.31465922303802668,0.28105280149756257,0.28637040089161536,0.30916496802229265,0.28652315044235643,0.29692072883663523,0.28535118066294146,0.30484176420636272,0.25960611659200866,0.28040703950186374,0.21879603581978177,0.25517234394032329,0.24346514533569996,0.22892277824948704,0.20382318934131441,0.24019032907028559,0.23012756616086652,0.20459736388327687,0.2255967047721919,0.2099779634436513,0.21972460853046,0.23202702103366185,0.47558069722752522]
[195,"State of Palestine","PSE","State of Palestine","OPT 2019-2020","MENA","Western Asia","Western Asia and Northern Africa",null,"Full data, Source: MICS",null,"2019-2020","State of Palestine",0.97142857142857142,0.97247706422018354,0.95454545454545459,0.93069306930693074,0.90677966101694918,0.86538461538461542,0.86021505376344087,0.84693877551020413,0.7142857142857143,0.8,0.77108433734939763,0.64646464646464652,0.61904761904761907,0.56190476190476191,0.41880341880341881,0.4576271186440678,0.22222222222222221,0.23893805309734514,0.29292929292929293,0.1702127659574468,0.11224489795918367,0.11504424778761062,0.14606741573033707,0.11,9.7345132743362831E-2,9.0909090909090912E-2,4.6728971962616821E-2,5.8252427184466021E-2,2.3255813953488372E-2,4.3859649122807015E-2,6.0606060606060608E-2,4.3956043956043959E-2,1.0869565217391304E-2,3.6585365853658534E-2,4.0816326530612242E-2,1.0526315789473684E-2,null,9.375E-2]
[196,"Sudan","SDN","Sudan","Sudan 2015","ESA","Northern Africa","Western Asia and Northern Africa","LOW-INCOME","Full data, Source: MICS",null,"2015","Sudan",0.9939393939393939,0.99610894941634243,0.97770700636942676,0.98880597014925375,0.99206349206349209,0.98120300751879697,0.99145299145299148,0.99199999999999999,0.98045602605863191,0.97071129707112969,0.92553191489361697,0.93717277486910999,0.92622950819672134,0.87003610108303253,0.875,0.90688259109311742,0.78672985781990523,0.80800000000000005,0.76818181818181819,0.68926553672316382,0.61764705882352944,0.543010752688172,0.43448275862068964,0.33571428571428569,0.29032258064516131,0.18840579710144928,0.12888888888888889,0.15846994535519127,9.8591549295774641E-2,0.17708333333333334,0.1210762331838565,0.16666666666666666,0.16544117647058823,0.12154696132596685,6.3291139240506333E-2,3.125E-2,0.2,0.651429291021282]
[197,"Suriname","SUR","Suriname","Suriname 2018","LAC","South America","Latin America and the Caribbean","UPPER-MIDDLE-INCOME","Full data, Source: MICS",null,"2018","Suriname",1,0.86885245901639341,0.8545454545454545,0.71739130434782605,0.72727272727272729,0.68656716417910446,0.7142857142857143,0.50909090909090904,0.40677966101694918,0.46666666666666667,0.48484848484848486,0.46774193548387094,0.33870967741935482,0.40384615384615385,0.3392857142857143,0.33333333333333331,0.20547945205479451,0.24561403508771928,0.26785714285714285,0.24615384615384617,0.125,0.15151515151515152,0.25423728813559321,0.1864406779661017,0.14705882352941177,0.13333333333333333,0.13846153846153847,6.1538461538461542E-2,0.13414634146341464,0.1875,0.12195121951219512,7.407407407407407E-2,7.2463768115942032E-2,8.7499999999999994E-2,4.5454545454545456E-2,5.1724137931034482E-2,null,0.32193342453260376]
[198,"Swaziland","SWZ","Swaziland","Swaziland 2014","ESA","Southern Africa",null,"LOWER-MIDDLE INCOME","Full data, Source: MICS",null,"2014","Swaziland",1,0.97619047619047616,0.97222222222222221,0.95238095238095233,0.93617021276595747,0.88372093023255816,0.88571428571428568,0.68888888888888888,0.8,0.73529411764705888,0.7567567567567568,0.67441860465116277,0.7021276595744681,0.61538461538461542,0.52777777777777779,0.38636363636363635,0.48571428571428571,0.2857142857142857,0.16216216216216217,0.2558139534883721,0.15,3.125E-2,7.4999999999999997E-2,0.08,9.7560975609756101E-2,5.5555555555555552E-2,7.5471698113207544E-2,0,7.5471698113207544E-2,4.2553191489361701E-2,0,0,0,2.3809523809523808E-2,0,0,0,0.37737127371273715]
[199,"Sweden","SWE",null,null,"WE",null,null,"HIGH-INCOME","Partial data, Source: National survey",null,"2010","Sweden",0.98,null,null,null,null,0.52,null,null,null,null,null,0.16]
[200,"Switzerland","CHE",null,null,"WE",null,null,"HIGH-INCOME","Partial data, Source: National survey",null,"2003","Switzerland",0.94,null,null,null,null,0.62,null,null,null,null,null,0.28000000000000003]
[201,"Syrian Arab Republic","SYR","Syrian Arab Republic","Syria 2005","MENA","Western Asia","Western Asia and Northern Africa","LOW-INCOME","Full data, Source: MICS",null,"2005","Syrian Arab Republic",0.91891891891891897,0.97660818713450293,0.93877551020408168,0.92346938775510201,0.94328358208955221,0.9296875,0.8978102189781022,0.88976377952755903,0.8413793103448276,0.81081081081081086,0.86274509803921573,0.73873873873873874,0.72941176470588232,0.68108108108108112,0.70283018867924529,0.64583333333333337,0.5,0.37634408602150538,0.36170212765957449,0.32727272727272727,0.2288135593220339,0.19685039370078741,0.1134020618556701,0.1415929203539823,0.12093023255813953,7.407407407407407E-2,6.4935064935064929E-2,7.6246334310850442E-2,6.535947712418301E-2,0.02,3.0303030303030304E-2,2.6548672566371681E-2,6.363636363636363E-2,4.7244094488188976E-2,7.8260869565217397E-2,1.5873015873015872E-2,2.3474178403755867E-2,2.5830258302583026E-2,2.7777777777777776E-2,2.2535211267605635E-2,1.9434628975265017E-2,3.4090909090909088E-2,2.3529411764705882E-2,8.6206896551724137E-3,1.6666666666666666E-2,9.433962264150943E-3,2.9411764705882353E-2,1.9607843137254902E-2,2.0408163265306121E-2,1.4354066985645933E-2,1.8099547511312219E-2,1.1627906976744186E-2,1.3303769401330377E-2,0,1.3698630136986301E-2,4.0540540540540543E-2,1.2500000000000001E-2,0,0,2.2222222222222223E-2,0.28059585239996104]
[202,"Tajikistan","TJK","Tajikistan","DHS-Tajikistan 2017","EECA","Central Asia","Central Asia and Southern Asia","LOWER-MIDDLE INCOME","Full data, Source: DHS",null,"2017","Tajikistan",0.91249999999999998,0.96590909090909094,0.92929292929292928,0.96739130434782605,0.93457943925233644,0.91111111111111109,0.91428571428571426,0.90476190476190477,0.93617021276595747,0.85185185185185186,0.87254901960784315,0.85185185185185186,0.7416666666666667,0.76271186440677963,0.72549019607843135,0.68478260869565222,0.61165048543689315,0.61904761904761907,0.67272727272727273,0.56666666666666665,0.625,0.46938775510204084,0.44262295081967212,0.421875,0.40170940170940173,0.32,0.29702970297029702,0.38793103448275862,0.30476190476190479,0.28735632183908044,0.43434343434343436,0.34042553191489361,0.39622641509433965,0.33333333333333331,0.28205128205128205,0.40157480314960631,0.36,0.33913043478260868,0.40206185567010311,0.35227272727272729,0.30864197530864196,0.32967032967032966,0.31818181818181818,0.30208333333333331,0.3235294117647059,0.28947368421052633,0.23300970873786409,0.34166666666666667,0.25806451612903225,0.24489795918367346,0.26732673267326734,0.30769230769230771,0.21212121212121213,0.25531914893617019,0.23287671232876711,0.34146341463414637,0.21917808219178081,0.34567901234567899,0.16470588235294117,0.3,0.49147727272727271]
[203,"Thailand","THA","Thailand","Thai 2019","SEA","South-Eastern Asia","Eastern Asia and South-eastern Asia","UPPER-MIDDLE-INCOME","Full data, Source: MICS",null,"2019","Thailand",0.9375,0.82978723404255317,0.79844961240310075,0.78400000000000003,0.73015873015873012,0.58823529411764708,0.51515151515151514,0.50632911392405067,0.50724637681159424,0.43965517241379309,0.42922374429223742,0.34188034188034189,0.39408866995073893,0.27102803738317754,0.25738396624472576,0.27751196172248804,0.25870646766169153,0.25,0.23275862068965517,0.21333333333333335,0.17279411764705882,0.17509727626459143,0.1875,0.12916666666666668,0.1004566210045662,0.13168724279835392,9.3617021276595741E-2,8.0586080586080591E-2,7.1729957805907171E-2,9.2105263157894732E-2,7.3593073593073599E-2,4.8979591836734691E-2,6.8181818181818177E-2,9.3877551020408165E-2,7.0370370370370375E-2,5.2083333333333336E-2,0.25957222075521519]
[204,"Timor-Leste","TLS","Timor-Leste","Timor Leste 2016","SEA","South-Eastern Asia","Eastern Asia and South-eastern Asia","LOWER-MIDDLE INCOME","Full data, Source: MICS",null,"2016","Timor-Leste",0.92105263157894735,0.99137931034482762,0.91366906474820142,0.92173913043478262,0.8928571428571429,0.95652173913043481,0.88970588235294112,0.8771929824561403,0.92372881355932202,0.86554621848739499,0.83486238532110091,0.82795698924731187,0.66129032258064513,0.671875,0.60747663551401865,0.64864864864864868,0.52032520325203258,0.62686567164179108,0.44247787610619471,0.49,0.57407407407407407,0.48818897637795278,0.37234042553191488,0.51351351351351349,0.39473684210526316,0.47899159663865548,0.39784946236559138,0.44144144144144143,0.41666666666666669,0.40740740740740738,0.44247787610619471,0.3983739837398374,0.40206185567010311,0.41836734693877553,0.40229885057471265,0.3902439024390244,0.36792452830188677,0.44642857142857145,0.44067796610169491,0.34677419354838712,0.44029850746268656,0.38345864661654133,0.38842975206611569,0.44347826086956521,0.32631578947368423,0.47572815533980584,0.3707865168539326,0.38157894736842107,0.47191011235955055,0.41284403669724773,0.42063492063492064,0.42622950819672129,0.26923076923076922,0.31034482758620691,0.37984496124031009,0.33333333333333331,0.44117647058823528,0.29906542056074764,0.40740740740740738,0.30666666666666664,0.53917464114832536]
[205,"Togo","TGO","Togo","Togo 2010","WCA","Western Africa","Sub-Saharan Africa","LOW-INCOME","Full data, Source: MICS",null,"2010","Togo",0.97916666666666663,0.9887640449438202,1,0.98734177215189878,0.97247706422018354,0.98795180722891562,1,1,0.98412698412698407,0.98630136986301364,0.97468354430379744,0.96808510638297873,0.95294117647058818,0.92405063291139244,0.95238095238095233,0.93055555555555558,0.97727272727272729,0.92537313432835822,0.85333333333333339,0.84931506849315064,0.76388888888888884,0.68571428571428572,0.63855421686746983,0.60810810810810811,0.43157894736842106,0.29069767441860467,0.15625,0.18518518518518517,0.17857142857142858,0.16,0.24050632911392406,0.10256410256410256,8.247422680412371E-2,0.11392405063291139,0.10606060606060606,3.896103896103896E-2,3.7735849056603772E-2,6.4102564102564097E-2,2.6315789473684209E-2,3.4090909090909088E-2,5.0632911392405063E-2,1.0869565217391304E-2,3.2258064516129031E-2,1.3157894736842105E-2,2.4390243902439025E-2,1.6393442622950821E-2,1.7857142857142856E-2,4.4776119402985072E-2,4.5977011494252873E-2,7.1428571428571425E-2,3.614457831325301E-2,0,1.1904761904761904E-2,1.4084507042253521E-2,3.125E-2,4.0540540540540543E-2,1.7543859649122806E-2,3.3333333333333333E-2,0.02,5.7692307692307696E-2,0.43278759155536406]
[206,"Tokealau","TKL",null,null,"OC",null,null,null,"No data",null,null,"Tokealau"]
[207,"Tonga","TON","Tonga","Tonga 2019","OC","Oceania","Oceania excluding Australia and New Zealand","UPPER-MIDDLE-INCOME","Full data, Source: MICS",null,"2019","Tonga",1,1,0.94117647058823528,0.88461538461538458,0.90476190476190477,0.93333333333333335,0.78947368421052633,0.75,0.66666666666666663,0.8125,0.63157894736842102,0.54545454545454541,0.6428571428571429,0.7142857142857143,0.55555555555555558,0.33333333333333331,0.42857142857142855,0.29411764705882354,0.26666666666666666,0.33333333333333331,0.23529411764705882,0.2857142857142857,0.45454545454545453,0.42105263157894735,0.23076923076923078,0.2,0.22727272727272727,0.16,0.29411764705882354,9.5238095238095233E-2,0.20833333333333334,0.1,0,0.125,0.15,0.125,0.45553822152886114]
[208,"Trinidad and Tobago","TTO","Trinidad and Tobago","Trinidad & Tobago 2011","LAC","Caribbean","Latin America and the Caribbean","HIGH-INCOME","Full data, Source: MICS",null,"2011","Trinidad and Tobago",1,0.91304347826086951,0.95238095238095233,0.875,0.875,0.7142857142857143,0.61111111111111116,0.7,0.5,0.5,0.6470588235294118,0.32,0.42857142857142855,0.625,0.55555555555555558,0.45454545454545453,0.53846153846153844,0.33333333333333331,0.625,0.26666666666666666,0.5,0.35714285714285715,0.23809523809523808,0.36842105263157893,0.17857142857142858,0.15789473684210525,0.2,0.3,0.27272727272727271,6.25E-2,0.1,0.30769230769230771,0.375,0.1875,5.5555555555555552E-2,0.13636363636363635,0.15384615384615385,9.375E-2,4.3478260869565216E-2,0.17391304347826086,0.13333333333333333,0,5.5555555555555552E-2,0,0.14285714285714285,0.2,0.13636363636363635,0.12,5.5555555555555552E-2,0.1,9.5238095238095233E-2,0,0.04,0,0,9.0909090909090912E-2,0,0,0,0.1,0.27906976744186046]
[209,"Tunisia","TUN","Tunisia","Tunisia 2018","MENA","Northern Africa","Western Asia and Northern Africa","LOWER-MIDDLE INCOME","Full data, Source: MICS",null,"2018","Tunisia",1,0.97499999999999998,0.91666666666666663,0.90384615384615385,0.68,0.85416666666666663,0.7407407407407407,0.76271186440677963,0.74358974358974361,0.64583333333333337,0.71111111111111114,0.65116279069767447,0.6333333333333333,0.53191489361702127,0.46153846153846156,0.51020408163265307,0.35294117647058826,0.29166666666666669,0.45283018867924529,0.20454545454545456,0.28301886792452829,0.18421052631578946,0.12820512820512819,0.1111111111111111,0.2,9.3023255813953487E-2,3.5714285714285712E-2,7.1428571428571425E-2,9.3023255813953487E-2,9.0909090909090912E-2,0.10416666666666667,4.2553191489361701E-2,3.7735849056603772E-2,1.6949152542372881E-2,0.04,null,2.4390243902439025E-2]
[210,"Turkey","TUR","Turkey","DHS-TR 2013","EECA","Western Asia","Western Asia and Northern Africa","UPPER-MIDDLE-INCOME","Full data, Source: DHS",null,"2013","Turkey",1,0.96825396825396826,0.94444444444444442,0.95588235294117652,0.87878787878787878,0.91549295774647887,0.76811594202898548,0.92307692307692313,0.72727272727272729,0.71641791044776115,0.72916666666666663,0.53448275862068961,0.78,0.6619718309859155,0.625,0.62857142857142856,0.62318840579710144,0.54838709677419351,0.43548387096774194,0.38356164383561642,0.49180327868852458,0.52830188679245282,0.24193548387096775,0.35185185185185186,0.33870967741935482,0.26027397260273971,0.23809523809523808,0.17307692307692307,0.3125,0.2,0.25396825396825395,0.17777777777777778,0.2153846153846154,0.14893617021276595,0.18,0.23404255319148937,0.1875,0.13207547169811321,0.26760563380281688,0.15714285714285714,0.265625,0.23076923076923078,0.27272727272727271,0.2,0.28301886792452829,0.22580645161290322,0.22222222222222221,0.23728813559322035,0.21875,0.25454545454545452,0.18055555555555555,0.20481927710843373,0.24637681159420291,0.23728813559322035,0.22222222222222221,0.18840579710144928,0.2,0.30434782608695654,0.20634920634920634,0.22950819672131148,0.4069023100473142]
[211,"Turkmenistan","TKM","Turkmenistan","Turk 2019","EECA","Central Asia","Central Asia and Southern Asia","UPPER-MIDDLE-INCOME","Full data, Source: MICS",null,"2019","Turkmenistan",1,0.97727272727272729,1,1,0.93181818181818177,1,0.97777777777777775,0.92753623188405798,0.94230769230769229,0.9,0.890625,0.86440677966101698,0.77586206896551724,0.63888888888888884,0.8392857142857143,0.5,0.63492063492063489,0.43478260869565216,0.39655172413793105,0.39655172413793105,0.16901408450704225,0.25714285714285712,0.16071428571428573,0.15517241379310345,0,2.7777777777777776E-2,5.0847457627118647E-2,4.6875E-2,3.4482758620689655E-2,4.5454545454545456E-2,6.1538461538461542E-2,1.6666666666666666E-2,4.3478260869565216E-2,4.5454545454545456E-2,0,0,null,0.44648910411622278]
[212,"Turks and Caicos Island","TCA","Turks and Caicos Islands","MICS-Turks and Caicos Islands 2019-2020 (very small sample)","LAC","Carribean",{"$error":"#N/A"},"HIGH-INCOME","Full data, Source: MICS",null,"2019-20","Turks and Caicos Island",1,0.66666666666666663,0,1,0.5714285714285714,1,0,1,0,0.2,0.25,0.33333333333333331,0.5,0.25,0.33333333333333331,0.25,0,0,0,0.33333333333333331,0,0.14285714285714285,0,0.1,0,0,0,0,0,0.25,0,0,0.14285714285714285,0,0.21739130434782608]
[213,"Tuvalu","TUV","Tuvalu","MICS-Tuvalo 2019","OC","Oceania","Oceania excluding Australia and New Zealand","UPPER-MIDDLE-INCOME","Full data, Source: MICS",null,"2019","Tuvalu",0.5,0.92307692307692313,1,0.33333333333333331,0.875,0.77777777777777779,0.42857142857142855,1,0.625,0.25,0.6,0.77777777777777779,0.5714285714285714,0.25,0.375,0,0.42857142857142855,0.55555555555555558,0.5,0,0,0.33333333333333331,0.44444444444444442,0.33333333333333331,0.33333333333333331,0.5,0.33333333333333331,0.125,0.375,0.2,0,0.1111111111111111,0.25,0.4,0.5,0.33333333333333331,0.46969696969696972]
[214,"Uganda","UGA","Uganda","DHS-Uganda 2016","ESA","Eastern Africa","Sub-Saharan Africa","LOW-INCOME","Full data, Source: DHS",null,"2016","Uganda",0.93243243243243246,0.96842105263157896,0.97894736842105268,0.98630136986301364,0.9452054794520548,0.94444444444444442,0.98863636363636365,0.98734177215189878,0.95744680851063835,0.9642857142857143,0.97368421052631582,0.96250000000000002,0.88888888888888884,0.87356321839080464,0.84523809523809523,0.88235294117647056,0.8314606741573034,0.67901234567901236,0.68,0.63513513513513509,0.5662650602409639,0.47435897435897434,0.51470588235294112,0.37234042553191488,0.34482758620689657,0.26804123711340205,0.27500000000000002,0.35294117647058826,0.3595505617977528,0.33750000000000002,0.33333333333333331,0.29577464788732394,0.37681159420289856,0.41176470588235292,0.31944444444444442,0.42105263157894735,0.39506172839506171,0.40909090909090912,0.32,0.41176470588235292,0.40909090909090912,0.52564102564102566,0.40909090909090912,0.37662337662337664,0.44262295081967212,0.47887323943661969,0.38709677419354838,0.41538461538461541,0.44318181818181818,0.30666666666666664,0.32203389830508472,0.48333333333333334,0.30434782608695654,0.34285714285714286,0.40845070422535212,0.37142857142857144,0.41176470588235292,0.34210526315789475,0.40277777777777779,0.27586206896551724,0.56953642384105962]
[215,"Ukraine","UKR","Ukraine","Ukraine 2012","EECA","Eastern Europe","Northern America and Europe","LOWER-MIDDLE INCOME","Full data, Source: MICS",null,"2012","Ukraine",1,0.96,0.9464285714285714,0.83823529411764708,0.875,0.87142857142857144,0.8214285714285714,0.82666666666666666,0.57627118644067798,0.55072463768115942,0.68656716417910446,0.54545454545454541,0.52083333333333337,0.37662337662337664,0.36559139784946237,0.30769230769230771,0.38961038961038963,0.21212121212121213,0.36,0.25423728813559321,0.203125,0.20779220779220781,0.1111111111111111,0.20689655172413793,0.11538461538461539,9.3333333333333338E-2,5.9701492537313432E-2,3.896103896103896E-2,4.8192771084337352E-2,3.0303030303030304E-2,5.2631578947368418E-2,4.6875E-2,0,8.1632653061224483E-2,0,3.8461538461538464E-2,3.0303030303030304E-2,2.7027027027027029E-2,2.3529411764705882E-2,1.2345679012345678E-2,0,0,0,0,1.282051282051282E-2,1.5151515151515152E-2,1.2500000000000001E-2,0,0,0,1.3698630136986301E-2,0,1.3333333333333334E-2,0,0,0,1.2658227848101266E-2,0,0,1.0752688172043012E-2,0.19960716916277929]
[216,"United Arab Emirates","ARE",null,null,"MENA",null,null,"HIGH-INCOME","No data, regional estimates only ",null,null,"United Arab Emirates",0.89555555555555555,1,0.93548387096774188,0.91666666666666663,1,0.37393162393162394,0.75609756097560976,0.72727272727272729,0.65384615384615385,0.70731707317073167,0.61702127659574468,0.52333333333333332,0.52631578947368418,0.70967741935483875,0.63636363636363635,0.61538461538461542,0.57894736842105265,0.52380952380952384,0.375,0.21875,0.36363636363636365,0.34482758620689657,0.33333333333333331,0.13157894736842105,0.11764705882352941,0.13793103448275862,0.21621621621621623,0.16216216216216217,0.10256410256410256,0.12121212121212122,8.3333333333333329E-2,0.27272727272727271,5.2631578947368418E-2,0,0.08,7.8947368421052627E-2,6.6666666666666666E-2,5.4545454545454543E-2,5.7142857142857141E-2,6.6666666666666666E-2,0.05,0.10344827586206896,9.0909090909090912E-2,0,4.3478260869565216E-2,0.08,3.4482758620689655E-2,0,0,2.4390243902439025E-2,2.564102564102564E-2,7.1428571428571425E-2,8.8235294117647065E-2,3.0303030303030304E-2,4.5454545454545456E-2,0.05,3.7037037037037035E-2,0,0.1111111111111111,0,0.29205851619644724]
[217,"United Kingdom","GBR",null,null,"WE",null,null,"HIGH-INCOME","Partial data, Source: National survey",null,"2011","United Kingdom",0.81,null,null,null,null,0.34,null,null,null,null,null,5.0000000000000001E-3]
[218,"United Republic of Tanzania","TZA","United Republic of Tanzania","DHS-Tanzania  2015-2016","ESA","Eastern Africa","Sub-Saharan Africa","LOWER-MIDDLE INCOME","Full data, Source: DHS",null,"2015-16","United Republic of Tanzania",0.99487179487179489,0.98947368421052628,0.98305084745762716,0.95061728395061729,0.96153846153846156,0.97599999999999998,0.97948717948717945,0.98412698412698407,0.98051948051948057,0.98181818181818181,0.98275862068965514,0.97241379310344822,0.95580110497237569,0.89560439560439564,0.91534391534391535,0.90322580645161288,0.84946236559139787,0.83653846153846156,0.72192513368983957,0.73684210526315785,0.60233918128654973,0.53793103448275859,0.41875000000000001,0.33128834355828218,0.23178807947019867,0.25925925925925924,0.18064516129032257,0.28749999999999998,0.32167832167832167,0.36249999999999999,0.33561643835616439,0.3971631205673759,0.40287769784172661,0.37007874015748032,0.38461538461538464,0.42384105960264901,0.41891891891891891,0.40816326530612246,0.44295302013422821,0.38461538461538464,0.34814814814814815,0.43478260869565216,0.51127819548872178,0.48461538461538461,0.45378151260504201,0.44370860927152317,0.46728971962616822,0.47014925373134331,0.45695364238410596,0.44366197183098594,0.40939597315436244,0.44696969696969696,0.43065693430656932,0.42727272727272725,0.44696969696969696,0.3716216216216216,0.48031496062992124,0.42519685039370081,0.38931297709923662,0.40845070422535212]
[219,"United States of America","USA",null,null,"NA",null,null,"HIGH-INCOME","Partial data, Source: National survey",null,"2018","United States of America",0.82099999999999995,0.79900000000000004,0.75599999999999989,0.70900000000000007,0.64500000000000002,0.59299999999999997,0.56700000000000006,0.49099999999999999,0.46399999999999997,0.42899999999999999,0.39500000000000002,0.36899999999999999,0.35,null,null,null,null,null,0.14799999999999999]
[220,"United States Virgin Islands","VIR",null,null,"LAC",null,null,"HIGH-INCOME","No data, regional estimates only ",null,null,"United States Virgin Islands",0.97399999999999998,0.82657004830917868,0.65079365079365081,0.95833333333333337,0.7321428571428571,0.68085714285714283,0.41203703703703703,0.9,0.33333333333333331,0.39999999999999997,0.44716775599128544,0.33866666666666662,0.53174603174603174,0.56944444444444453,0.40740740740740738,0.50151515151515158,0.32234432234432231,0.1111111111111111,0.33333333333333331,0.42222222222222222,0.23333333333333331,0.30952380952380953,0.12698412698412698,0.23021442495126701,0.17063492063492061,0.11929824561403508,0.11428571428571428,0.15555555555555556,9.0909090909090898E-2,0.10416666666666667,0.10000000000000002,0.10256410256410257,0.17261904761904759,6.25E-2,0.15764895330112719,0.1396103896103896,7.6923076923076927E-2,4.6875E-2,2.1739130434782608E-2,8.6956521739130432E-2,0.16666666666666669,0,2.7777777777777776E-2,0,0.17142857142857143,0.1,6.8181818181818177E-2,0.06,2.7777777777777776E-2,0.05,4.7619047619047616E-2,0,0.02,0,0,4.5454545454545456E-2,8.3333333333333329E-2,0,0,0.05,0.25920313016642788]
[221,"Uruguay","URY",null,null,"LAC",null,null,"HIGH-INCOME","Partial data, Source: National survey of facility user",null,"2011","Uruguay",0.98,null,null,null,null,0.64,null,null,null,null,null,0.45]
[222,"Uzbekistan","UZB","Uzbekistan","Uzbekistan 2000","EECA","Central Asia","Central Asia and Southern Asia","LOWER-MIDDLE INCOME","Full data, Source: MICS",null,"2000","Uzbekistan",0.96666666666666667,1,0.92452830188679247,0.95,0.95744680851063835,0.9107142857142857,0.90243902439024393,0.93877551020408168,0.90566037735849059,0.89473684210526316,0.91666666666666663,0.88235294117647056,0.81481481481481477,0.8125,0.74285714285714288,0.71875,0.69230769230769229,0.77777777777777779,0.51219512195121952,0.51020408163265307,0.47916666666666669,0.44444444444444442,0.2978723404255319,0.34545454545454546,0.22580645161290322,0.21153846153846154,0.12962962962962962,0.29090909090909089,8.8888888888888892E-2,0.10714285714285714,0.11627906976744186,0.10638297872340426,0.06,5.4054054054054057E-2,0.11428571428571428,5.2631578947368418E-2,5.5555555555555552E-2,2.9850746268656716E-2,3.3898305084745763E-2,4.4776119402985072E-2,7.8431372549019607E-2,3.9215686274509803E-2,7.8125E-2,5.0847457627118647E-2,6.25E-2,4.4444444444444446E-2,1.8867924528301886E-2,0,3.3898305084745763E-2,0,0,2.2222222222222223E-2,4.4444444444444446E-2,1.6666666666666666E-2,2.3809523809523808E-2,0,5.5555555555555552E-2,1.9607843137254902E-2,1.6666666666666666E-2,2.4390243902439025E-2,0.33438485804416401]
[223,"Vanuatu","VUT",null,null,"OC",null,null,"LOWER-MIDDLE INCOME","No data, regional estimates only ",null,null,"Vanuatu",0.94696969696969702,0.9859154929577465,0.98124999999999996,0.94350679793717762,0.95714285714285707,0.92560975609756091,0.98351648351648358,0.95601265822784809,0.91819034224097518,0.96688034188034189,0.97272727272727266,0.86425339366515841,0.9010878323932312,0.88669590643274854,0.88163771712158812,0.81589537223340036,0.85460030165912526,0.79583333333333339,0.85732916014606153,0.85810810810810811,0.85678749111584929,0.76178660049627789,0.77606060606060612,0.76354489164086692,0.73262548262548255,0.70885579937304066,0.77663671373555843,0.77038750722961247,0.79414682539682535,0.68965517241379315,0.6875,0.71805555555555556,0.66934046345811049,0.71987179487179487,0.68095238095238098,0.6897260273972603]
[224,"Vatican","VAT",null,null,"WE",null,null,null,"No data",null,null,"Vatican"]
[225,"Venezuela (Bolivarian Republic of)","VEN",null,null,"LAC",null,null,null,"No data, regional estimates only ",null,null,"Venezuela (Bolivarian Republic of)",0.98404898070219438,0.95114981845932101,0.91419125081647223,0.89928898699090765,0.82955802847107174,0.80853841756577249,0.74343980961754896,0.66910043507624062,0.69564514620853901,0.68418395249350406,0.63900699390709026,0.63847983592903479,0.55595417591809237,0.52340583884260383,0.52681197053092421,0.4817583671052153,0.43106568031795545,0.43071447307585564,0.37733453523855259,0.42362783907949375,0.39098333591676654,0.3587951278296595,0.32572179864892775,0.31202294279306025,0.26911338948084845,0.26577258993075253,0.22719262442619792,0.20774452266974597,0.1902174466831999,0.19984499320747881,0.15260210761110038,0.16304952926767929,0.12291632378637377,0.13379755283014216,0.13314573283153516,0.12218932414899568,0.21956300413480639,0.27735050797464272,0.13740740740740739,0.11543818466353679,0.10759911894273126,0.12222173698596354,0.11489878970456105,0.13644927536231882,9.4820828667413232E-2,9.1609055501460562E-2,0.11373730838801674,0.10281385281385283,0.11727685613743133,9.2472832506496558E-2,9.0446051838456901E-2,8.9826839826839824E-2,9.5770932607215781E-2,9.6883116883116877E-2,8.0848377390930579E-2,8.523328523328523E-2,0.10497835497835498,8.9740584466322854E-2,8.8914276709738407E-2,9.8021071919377006E-2,0.34483306401539321]
[226,"Viet Nam","VNM","Viet Nam","Viet 2013_14","SEA","South-Eastern Asia","Eastern Asia and South-eastern Asia","LOWER-MIDDLE INCOME","Full data, Source: MICS",null,"2013-14","Viet Nam",1,1,0.9452054794520548,0.98461538461538467,0.98630136986301364,0.9375,0.98148148148148151,0.90163934426229508,0.83333333333333337,0.83636363636363631,0.796875,0.89830508474576276,0.89655172413793105,0.76271186440677963,0.62857142857142856,0.55555555555555558,0.55172413793103448,0.46031746031746029,0.41791044776119401,0.32051282051282054,0.22972972972972974,0.24615384615384617,0.17307692307692307,0.27659574468085107,0.19607843137254902,0.16,6.1224489795918366E-2,7.6923076923076927E-2,0.12244897959183673,0.18367346938775511,4.9180327868852458E-2,6.8965517241379309E-2,8.6956521739130432E-2,0.02,0,0.10204081632653061,4.7619047619047616E-2,0.49975903614457834]
[227,"Wallis and Futuna","WLF",null,null,null,null,null,null,"No data",null,null,"Wallis and Futuna"]
[228,"Western Sahara","ESH",null,null,"MENA",null,null,null,"No data",null,null,"Western Sahara"]
[229,"Yemen","YEM","Yemen","DHS-Yemen  2013","MENA","Western Asia","Western Asia and Northern Africa","LOW-INCOME","Full data, Source: DHS",null,"2013","Yemen",0.93382352941176472,0.93959731543624159,0.9388379204892966,0.9320987654320988,0.9119718309859155,0.90764331210191085,0.90842490842490842,0.88353413654618473,0.82178217821782173,0.84121621621621623,0.80246913580246915,0.74468085106382975,0.7232472324723247,0.74782608695652175,0.70478723404255317,0.69135802469135799,0.68461538461538463,0.65677966101694918,0.65966386554621848,0.59523809523809523,0.54148471615720528,0.53535353535353536,0.51308900523560208,0.5,0.42279411764705882,0.3875739644970414,0.37254901960784315,0.40939597315436244,0.39100346020761245,0.38709677419354838,0.36324786324786323,0.41891891891891891,0.42325581395348838,0.42592592592592593,0.37569060773480661,0.39523809523809522,0.40196078431372551,0.37804878048780488,0.4,0.36655948553054662,0.37583892617449666,0.43706293706293708,0.45248868778280543,0.40096618357487923,0.44339622641509435,0.47191011235955055,0.3742690058479532,0.36571428571428571,0.37410071942446044,0.44578313253012047,0.41558441558441561,0.38730158730158731,0.35379061371841153,0.34745762711864409,0.40485829959514169,0.38812785388127852,0.40080971659919029,0.39267015706806285,0.41614906832298137,0.33774834437086093,0.54967362924281982]
[230,"Zambia","ZMB","Zambia","DHS-Zambia 2018-2019","ESA","Eastern Africa","Sub-Saharan Africa","LOWER-MIDDLE INCOME","Full data, Source: DHS",null,"2018-2019","Zambia",0.96256684491978606,0.91463414634146345,0.94082840236686394,0.98235294117647054,0.97499999999999998,0.9719101123595506,0.97986577181208057,0.96969696969696972,0.94630872483221473,0.91907514450867056,0.94927536231884058,0.94252873563218387,0.9375,0.94219653179190754,0.86875000000000002,0.88888888888888884,0.7975460122699386,0.79020979020979021,0.69696969696969702,0.57342657342657344,0.48749999999999999,0.32214765100671139,0.29069767441860467,0.18471337579617833,0.17532467532467533,0.16666666666666666,0.1464968152866242,0.16374269005847952,0.15172413793103448,0.20270270270270271,0.19047619047619047,0.18867924528301888,0.24812030075187969,0.21276595744680851,0.26470588235294118,0.22448979591836735,0.26451612903225807,0.30069930069930068,0.33548387096774196,0.2937062937062937,0.34415584415584416,0.352112676056338,0.3235294117647059,0.38095238095238093,0.33088235294117646,0.45238095238095238,0.31617647058823528,0.31724137931034485,0.42567567567567566,0.41216216216216217,0.3724137931034483,0.35338345864661652,0.41059602649006621,0.32061068702290074,0.32,0.31468531468531469,0.31914893617021278,0.33333333333333331,0.34677419354838712,0.38297872340425532]
[231,"Zimbabwe","ZWE","Zimbabwe","Zimbabwe 2018-2019","ESA","Eastern Africa","Sub-Saharan Africa","LOWER-MIDDLE INCOME","Full data, Source: MICS",null,"2018-19","Zimbabwe",1,1,0.98484848484848486,1,0.99145299145299148,0.98076923076923073,1,0.98148148148148151,1,0.97727272727272729,0.9885057471264368,0.94252873563218387,0.89130434782608692,0.8666666666666667,0.81372549019607843,0.77894736842105261,0.73913043478260865,0.6741573033707865,0.4642857142857143,0.38947368421052631,0.22916666666666666,0.125,0.12,0.03,3.2258064516129031E-2,2.7272727272727271E-2,2.7777777777777776E-2,9.0909090909090905E-3,2.1276595744680851E-2,9.0909090909090905E-3,9.7087378640776691E-3,2.5210084033613446E-2,2.0202020202020204E-2,0,3.0612244897959183E-2,2.1505376344086023E-2,0.50141723356009071]

{"sheet":"Sheet2","index":24,"n_rows":230,"n_cols":9,"rows_kept":230,"cut":false,"hidden":true,"merged":[]}
[null,"Country","Short Source",null,"Country","Short Source",null,"Short Source"]
[null,"Afghanistan","Full data, Source: MICS",null,"Afghanistan","MICS",null,"Full data, Source: MICS"]
[null,"Albania","Full data, Source: DHS",null,"Albania","DHS",null,"Full data, Source: DHS"]
[null,"Algeria","Full data, Source: MICS",null,"Algeria","MICS",null,"Full data, Source: MICS"]
[null,"American samoa","No data",null,"American samoa",null,null,"No data"]
[null,"Andorra","No data",null,"Andorra",null,null,"No data"]
[null,"Angola","Full data, Source: DHS",null,"Angola","DHS",null,"Full data, Source: DHS"]
[null,"Anguilla","No data",null,"Anguilla",null,null,"No data"]
[null,"Antigua and Barbuda","Regional Ave.",null,"Antigua and Barbuda","Regional Ave.",null,"No data, regional estimates only "]
[null,"Argentina","Full data, Source: MICS",null,"Argentina","MICS",null,"Full data, Source: MICS"]
[null,"Armenia","Full data, Source: DHS",null,"Armenia","DHS",null,"Full data, Source: DHS"]
[null,"Aruba","Regional Ave.",null,"Aruba","Regional Ave.",null,"No data, regional estimates only "]
[null,"Australia",null,null,"Australia"]
[null,"Austria","Partial data: Source: LANCET",null,"Austria","LANCET",null,"Partial data: Source: LANCET"]
[null,"Azerbaijan","Full data, Source: DHS",null,"Azerbaijan","DHS",null,"Full data, Source: DHS"]
[null,"Bahamas","Regional Ave.",null,"Bahamas","Regional Ave.",null,"No data, regional estimates only "]
[null,"Bahrain","Regional Ave.",null,"Bahrain","Regional Ave.",null,"No data, regional estimates only "]
[null,"Bangladesh","Full data, Source: MICS",null,"Bangladesh","MICS",null,"Full data, Source: MICS"]
[null,"Barbados","Full data, Source: MICS",null,"Barbados","MICS",null,"Full data, Source: MICS"]
[null,"Belarus","Full data, Source: MICS",null,"Belarus","MICS",null,"Full data, Source: MICS"]
[null,"Belgium","No data",null,"Belgium",null,null,"No data"]
[null,"Belize","Full data, Source: MICS",null,"Belize","MICS",null,"Full data, Source: MICS"]
[null,"Benin","Full data, Source: DHS",null,"Benin","DHS",null,"Full data, Source: DHS"]
[null,"Bermuda","No data",null,"Bermuda",null,null,"No data"]
[null,"Bhutan","Full data, Source: MICS",null,"Bhutan","MICS",null,"Full data, Source: MICS"]
[null,"Bolivia (Plurinational State of)","Full data, Source: DHS",null,"Bolivia (Plurinational State of)","DHS",null,"Full data, Source: DHS"]
[null,"Bosnia and Herzegovina","Full data, Source: MICS",null,"Bosnia and Herzegovina","MICS",null,"Full data, Source: MICS"]
[null,"Botswana","Full data, Source: MICS",null,"Botswana","MICS",null,"Full data, Source: MICS"]
[null,"Brazil",null,null,"Brazil"]
[null,"British Virgin Island","Regional Ave.",null,"British Virgin Island","Regional Ave.",null,"No data, regional estimates only "]
[null,"Brunei Darussalam","Regional Ave. ",null,"Brunei Darussalam","Regional Ave. ",null,"No data, regional estimates only  "]
[null,"Bulgaria","Regional Ave.",null,"Bulgaria","Regional Ave.",null,"No data, regional estimates only "]
[null,"Burkina Faso","Full data, Source: MICS",null,"Burkina Faso","MICS",null,"Full data, Source: MICS"]
[null,"Burundi","Full data, Source: DHS",null,"Burundi","DHS",null,"Full data, Source: DHS"]
[null,"Cabo Verde","Regional Ave. ",null,"Cabo Verde","Regional Ave. ",null,"No data, regional estimates only  "]
[null,"Cambodia","Full data, Source: DHS",null,"Cambodia","DHS",null,"Full data, Source: DHS"]
[null,"Cameroon","Full data, Source: MICS",null,"Cameroon","MICS",null,"Full data, Source: MICS"]
[null,"Canada",null,null,"Canada"]
[null,"Cayman Island","Regional Ave.",null,"Cayman Island","Regional Ave.",null,"No data, regional estimates only "]
[null,"Central African Republic","Full data, Source: MICS",null,"Central African Republic","MICS",null,"Full data, Source: MICS"]
[null,"Chad","Full data, Source: MICS",null,"Chad","MICS",null,"Full data, Source: MICS"]
[null,"Channel Islands","No data",null,"Channel Islands",null,null,"No data"]
[null,"Chile","Partial data: Source: LANCET",null,"Chile","LANCET",null,"Partial data: Source: LANCET"]
[null,"China","No data",null,"China",null,null,"No data"]
[null,"China, Hong Kong SAR","Regional Ave.",null,"China, Hong Kong SAR","Regional Ave.",null,"No data, regional estimates only "]
[null,"China, Macao SAR","Regional Ave.",null,"China, Macao SAR","Regional Ave.",null,"No data, regional estimates only "]
[null,"China, Taiwan Province of China","Regional Ave.",null,"China, Taiwan Province of China","Regional Ave.",null,"No data, regional estimates only "]
[null,"Colombia",null,null,"Colombia"]
[null,"Comoros","Full data, Source: MICS",null,"Comoros","MICS",null,"Full data, Source: MICS"]
[null,"Congo","Full data, Source: MICS",null,"Congo","MICS",null,"Full data, Source: MICS"]
[null,"Cook Island","No data",null,"Cook Island",null,null,"No data"]
[null,"Costa Rica","Full data, Source: MICS",null,"Costa Rica","MICS",null,"Full data, Source: MICS"]
[null,"Côte d'Ivoire","Full data, Source: MICS",null,"Côte d'Ivoire","MICS",null,"Full data, Source: MICS"]
[null,"Croatia","Regional Ave.",null,"Croatia","Regional Ave.",null,"No data, regional estimates only "]
[null,"Cuba","Full data, Source: MICS",null,"Cuba","MICS",null,"Full data, Source: MICS"]
[null,"Curaçao","No data",null,"Curaçao",null,null,"No data"]
[null,"Cyprus","No data",null,"Cyprus",null,null,"No data"]
[null,"Czechia","Partial data: Source: LANCET",null,"Czechia","LANCET",null,"Partial data: Source: LANCET"]
[null,"Dem. People's Republic of Korea","No data",null,"Dem. People's Republic of Korea",null,null,"No data"]
[null,"Democratic Republic of the Congo","Full data, Source: MICS",null,"Democratic Republic of the Congo","MICS",null,"Full data, Source: MICS"]
[null,"Denmark","Partial data: Source: LANCET",null,"Denmark","LANCET",null,"Partial data: Source: LANCET"]
[null,"Djibouti","Full data, Source: MICS",null,"Djibouti","MICS",null,"Full data, Source: MICS"]
[null,"Dominica",null,null,"Dominica"]
[null,"Dominican Republic","Full data, Source: MICS",null,"Dominican Republic","MICS",null,"Full data, Source: MICS"]
[null,"Ecuador",null,null,"Ecuador"]
[null,"Egypt","Full data, Source: MICS",null,"Egypt","MICS",null,"Full data, Source: MICS"]
[null,"El Salvador","Full data, Source: MICS",null,"El Salvador","MICS",null,"Full data, Source: MICS"]
[null,"Equatorial Guinea","No data",null,"Equatorial Guinea",null,null,"No data"]
[null,"Eritrea","Regional Ave.",null,"Eritrea","Regional Ave.",null,"No data, regional estimates only "]
[null,"Estonia","No data",null,"Estonia",null,null,"No data"]
[null,"Swaziland","Full data, Source: MICS",null,"Swaziland","MICS",null,"Full data, Source: MICS"]
[null,"Ethiopia","Full data, Source: DHS",null,"Ethiopia","DHS",null,"Full data, Source: DHS"]
[null,"Falkand Island","Regional Ave.",null,"Falkand Island","Regional Ave.",null,"No data, regional estimates only "]
[null,"Fiji","No data",null,"Fiji",null,null,"No data"]
[null,"Finland","Partial data: Source: LANCET",null,"Finland","LANCET",null,"Partial data: Source: LANCET"]
[null,"France","Partial data: Source: LANCET",null,"France","LANCET",null,"Partial data: Source: LANCET"]
[null,"French Guiana","No data",null,"French Guiana",null,null,"No data"]
[null,"French Polynesia","No data",null,"French Polynesia",null,null,"No data"]
[null,"Gabon","Full data, Source: DHS",null,"Gabon","DHS",null,"Full data, Source: DHS"]
[null,"Gambia","Full data, Source: DHS",null,"Gambia","DHS",null,"Full data, Source: DHS"]
[null,"Georgia","Full data, Source: MICS",null,"Georgia","MICS",null,"Full data, Source: MICS"]
[null,"Germany","Partial data: Source: LANCET",null,"Germany","LANCET",null,"Partial data: Source: LANCET"]
[null,"Ghana","Full data, Source: MICS",null,"Ghana","MICS",null,"Full data, Source: MICS"]
[null,"Gibraltar","No data",null,"Gibraltar",null,null,"No data"]
[null,"Greece","Partial data: Source: LANCET",null,"Greece","LANCET",null,"Partial data: Source: LANCET"]
[null,"Greenland","No data",null,"Greenland",null,null,"No data"]
[null,"Grenada","No data",null,"Grenada",null,null,"No data"]
[null,"Guadeloupe","No data",null,"Guadeloupe",null,null,"No data"]
[null,"Guam","No data",null,"Guam",null,null,"No data"]
[null,"Guatemala","Full data, Source: DHS",null,"Guatemala","DHS",null,"Full data, Source: DHS"]
[null,"Guinea","Full data, Source: MICS",null,"Guinea","MICS",null,"Full data, Source: MICS"]
[null,"Guinea-Bissau","Full data, Source: MICS",null,"Guinea-Bissau","MICS",null,"Full data, Source: MICS"]
[null,"Guyana","Full data, Source: MICS",null,"Guyana","MICS",null,"Full data, Source: MICS"]
[null,"Haiti","Full data, Source: DHS",null,"Haiti","DHS",null,"Full data, Source: DHS"]
[null,"Honduras","Full data, Source: MICS",null,"Honduras","MICS",null,"Full data, Source: MICS"]
[null,"Hungary","No data",null,"Hungary",null,null,"No data"]
[null,"Iceland","No data",null,"Iceland",null,null,"No data"]
[null,"India",null,null,"India"]
[null,"Indonesia","Full data, Source: DHS",null,"Indonesia","DHS",null,"Full data, Source: DHS"]
[null,"Iran (Islamic Republic of)","No data",null,"Iran (Islamic Republic of)","Regional Ave.",null,"No data, regional estimates only "]
[null,"Iraq","Full data, Source: MICS",null,"Iraq","MICS",null,"Full data, Source: MICS"]
[null,"Ireland","Partial data: Source: LANCET",null,"Ireland","LANCET",null,"Partial data: Source: LANCET"]
[null,"Israel","Regional Ave.",null,"Israel","Regional Ave.",null,"No data, regional estimates only "]
[null,"Italy","Partial data: Source: LANCET",null,"Italy","LANCET",null,"Partial data: Source: LANCET"]
[null,"Jamaica","Full data, Source: MICS",null,"Jamaica","MICS",null,"Full data, Source: MICS"]
[null,"Japan","Partial data: Source: LANCET",null,"Japan","LANCET",null,"Partial data: Source: LANCET"]
[null,"Jordan","Full data, Source: DHS",null,"Jordan","DHS",null,"Full data, Source: DHS"]
[null,"Kazakhstan","Full data, Source: MICS",null,"Kazakhstan","MICS",null,"Full data, Source: MICS"]
[null,"Kenya","Full data, Source: DHS",null,"Kenya","DHS",null,"Full data, Source: DHS"]
[null,"Kiribati","Full data, Source: MICS",null,"Kiribati","MICS",null,"Full data, Source: MICS"]
[null,"Kuwait","Regional Ave.",null,"Kuwait","Regional Ave.",null,"No data, regional estimates only "]
[null,"Kyrgyzstan","Full data, Source: MICS",null,"Kyrgyzstan","MICS",null,"Full data, Source: MICS"]
[null,"Lao People's Democratic Republic","Full data, Source: MICS",null,"Lao People's Democratic Republic","MICS",null,"Full data, Source: MICS"]
[null,"Latvia","No data",null,"Latvia",null,null,"No data"]
[null,"Lebanon","Regional Ave.",null,"Lebanon","Regional Ave.",null,"No data, regional estimates only ","No data"]
[null,"Lesotho","Full data, Source: MICS",null,"Lesotho","MICS",null,"Full data, Source: MICS"]
[null,"Liberia","Full data, Source: DHS",null,"Liberia","DHS",null,"Full data, Source: DHS","No data"]
[null,"Libya","Regional Ave.",null,"Libya","Regional Ave.",null,"No data, regional estimates only "]
[null,"Liechtenstein","No data",null,"Liechtenstein",null,null,"No data"]
[null,"Lithuania","No data",null,"Lithuania",null,null,"No data"]
[null,"Luxembourg","No data",null,"Luxembourg",null,null,"No data"]
[null,"Madagascar","Full data, Source: MICS",null,"Madagascar","MICS",null,"Full data, Source: MICS"]
[null,"Malawi","Full data, Source: DHS",null,"Malawi","DHS",null,"Full data, Source: DHS"]
[null,"Malaysia","No data",null,"Malaysia",null,null,"No data"]
[null,"Maldives","Full data, Source: DHS",null,"Maldives","DHS",null,"Full data, Source: DHS"]
[null,"Mali","Full data, Source: DHS",null,"Mali","DHS",null,"Full data, Source: DHS"]
[null,"Malta","No data",null,"Malta",null,null,"No data"]
[null,"Marshall Islands","No data",null,"Marshall Islands",null,null,"No data"]
[null,"Martinique","No data",null,"Martinique",null,null,"No data"]
[null,"Mauritania","Full data, Source: MICS",null,"Mauritania","MICS",null,"Full data, Source: MICS"]
[null,"Mauritius","Regional Ave.",null,"Mauritius","Regional Ave.",null,"No data, regional estimates only "]
[null,"Mayotte","No data",null,"Mayotte",null,null,"No data"]
[null,"Mexico","Full data, Source: MICS",null,"Mexico","MICS",null,"Full data, Source: MICS"]
[null,"Micronesia (Fed. States of)","No data",null,"Micronesia (Fed. States of)",null,null,"No data"]
[null,"Monaco","No data",null,"Monaco",null,null,"No data"]
[null,"Mongolia","Full data, Source: MICS",null,"Mongolia","MICS",null,"Full data, Source: MICS"]
[null,"Montenegro","Full data, Source: MICS",null,"Montenegro","MICS",null,"Full data, Source: MICS"]
[null,"Montserrat","No data",null,"Montserrat",null,null,"No data"]
[null,"Morocco","Full data, Source: DHS",null,"Morocco","DHS",null,"Full data, Source: DHS"]
[null,"Mozambique","Full data, Source: DHS",null,"Mozambique","DHS",null,"Full data, Source: DHS"]
[null,"Myanmar","Full data, Source: DHS",null,"Myanmar","DHS",null,"Full data, Source: DHS"]
[null,"Namibia","Full data, Source: DHS",null,"Namibia","DHS",null,"Full data, Source: DHS"]
[null,"Nauru","No data",null,"Nauru",null,null,"No data"]
[null,"Nepal","Full data, Source: DHS",null,"Nepal","DHS",null,"Full data, Source: DHS"]
[null,"Netherlands","Partial data: Source: LANCET",null,"Netherlands","LANCET",null,"Partial data: Source: LANCET"]
[null,"New Caledonia","No data",null,"New Caledonia",null,null,"No data"]
[null,"New Zealand","Partial data: Source: LANCET",null,"New Zealand","LANCET",null,"Partial data: Source: LANCET"]
[null,"Nicaragua","Regional Ave.",null,"Nicaragua","Regional Ave.",null,"No data, regional estimates only "]
[null,"Niger","Full data, Source: DHS",null,"Niger","DHS",null,"Full data, Source: DHS"]
[null,"Nigeria","Full data, Source: DHS",null,"Nigeria","DHS",null,"Full data, Source: DHS"]
[null,"Niue","No data",null,"Niue",null,null,"No data"]
[null,"North Macedonia","Full data, Source: MICS",null,"North Macedonia","MICS",null,"Full data, Source: MICS"]
[null,"Norfilk Island","No data",null,"Norfilk Island",null,null,"No data"]
[null,"Northern Mariana Island","No data",null,"Northern Mariana Island",null,null,"No data"]
[null,"Norway",null,null,"Norway"]
[null,"Oman","Partial data: Source: LANCET",null,"Oman","LANCET",null,"Partial data: Source: LANCET"]
[null,"Pakistan","Full data, Source: DHS",null,"Pakistan","DHS",null,"Full data, Source: DHS"]
[null,"Palau","No data",null,"Palau",null,null,"No data"]
[null,"Panama","Full data, Source: MICS",null,"Panama","MICS",null,"Full data, Source: MICS"]
[null,"Papua New Guinea","Full data, Source: DHS",null,"Papua New Guinea","DHS",null,"Full data, Source: DHS"]
[null,"Paraguay","Full data, Source: MICS",null,"Paraguay","MICS",null,"Full data, Source: MICS"]
[null,"Peru",null,null,"Peru"]
[null,"Philippines","Full data, Source: MICS",null,"Philippines","MICS",null,"Full data, Source: MICS"]
[null,"Pitcarin","No data",null,"Pitcarin",null,null,"No data"]
[null,"Poland","No data",null,"Poland",null,null,"No data"]
[null,"Portugal","No data",null,"Portugal",null,null,"No data"]
[null,"Puerto Rico","No data, regional estimates only ",null,"Puerto Rico","Regional Ave.",null,"No data, regional estimates only "]
[null,"Qatar","Full data, Source: MICS",null,"Qatar","MICS",null,"Full data, Source: MICS"]
[null,"Republic of Korea","Partial data: Source: LANCET",null,"Republic of Korea","LANCET",null,"Partial data: Source: LANCET"]
[null,"Republic of Moldova","Full data, Source: MICS",null,"Republic of Moldova","MICS",null,"Full data, Source: MICS"]
[null,"Réunion","No data",null,"Réunion",null,null,"No data"]
[null,"Romania","Regional Ave.",null,"Romania","Regional Ave.",null,"No data, regional estimates only "]
[null,"Russian Federation","Partial data: Source: LANCET",null,"Russian Federation","LANCET",null,"Partial data: Source: LANCET"]
[null,"Rwanda","Full data, Source: DHS",null,"Rwanda","DHS",null,"Full data, Source: DHS"]
[null,"Saint Kitts and Nevis","Regional Ave.",null,"Saint Kitts and Nevis","Regional Ave.",null,"No data, regional estimates only "]
[null,"Saint Lucia","Full data, Source: MICS",null,"Saint Lucia","MICS",null,"Full data, Source: MICS"]
[null,"Saint Vincent and the Grenadines",null,null,"Saint Vincent and the Grenadines"]
[null,"Samoa","No data",null,"Samoa",null,null,"No data"]
[null,"San Marino","No data",null,"San Marino",null,null,"No data"]
[null,"Sao Tome and Principe","Full data, Source: MICS",null,"Sao Tome and Principe","MICS",null,"Full data, Source: MICS"]
[null,"Saudi Arabia","Partial data: Source: LANCET",null,"Saudi Arabia","LANCET",null,"Partial data: Source: LANCET"]
[null,"Senegal","Full data, Source: DHS",null,"Senegal","DHS",null,"Full data, Source: DHS"]
[null,"Serbia","Full data, Source: MICS",null,"Serbia","MICS",null,"Full data, Source: MICS"]
[null,"Seychelles","No data",null,"Seychelles",null,null,"No data"]
[null,"Sierra Leone","Full data, Source: DHS",null,"Sierra Leone","DHS",null,"Full data, Source: DHS"]
[null,"Singapore","Partial data: Source: LANCET",null,"Singapore","LANCET",null,"Partial data: Source: LANCET"]
[null,"Slovakia","No data",null,"Slovakia",null,null,"No data"]
[null,"Slovenia","No data",null,"Slovenia",null,null,"No data"]
[null,"Solomon Islands","No data",null,"Solomon Islands",null,null,"No data"]
[null,"Somalia","Full data, Source: MICS",null,"Somalia","MICS",null,"Full data, Source: MICS"]
[null,"South Africa","Full data, Source: DHS",null,"South Africa","DHS",null,"Full data, Source: DHS"]
[null,"South Sudan","Full data, Source: MICS",null,"South Sudan","MICS",null,"Full data, Source: MICS"]
[null,"Spain","Partial data: Source: LANCET",null,"Spain","LANCET",null,"Partial data: Source: LANCET"]
[null,"Sri Lanka","Regional Ave.",null,"Sri Lanka","Regional Ave.",null,"No data, regional estimates only "]
[null,"State of Palestine","Full data, Source: MICS",null,"State of Palestine","MICS",null,"Full data, Source: MICS"]
[null,"Sudan",null,null,"Sudan"]
[null,"Suriname","Full data, Source: MICS",null,"Suriname","MICS",null,"Full data, Source: MICS"]
[null,"Sweden","Partial data: Source: LANCET",null,"Sweden","LANCET",null,"Partial data: Source: LANCET"]
[null,"Switzerland","Partial data: Source: LANCET",null,"Switzerland","LANCET",null,"Partial data: Source: LANCET"]
[null,"Syrian Arab Republic","Full data, Source: MICS",null,"Syrian Arab Republic","MICS",null,"Full data, Source: MICS"]
[null,"Tajikistan","Full data, Source: DHS",null,"Tajikistan","DHS",null,"Full data, Source: DHS"]
[null,"Thailand","Full data, Source: MICS",null,"Thailand","MICS",null,"Full data, Source: MICS"]
[null,"Timor-Leste","Full data, Source: MICS",null,"Timor-Leste","MICS",null,"Full data, Source: MICS"]
[null,"Togo","Full data, Source: MICS",null,"Togo","MICS",null,"Full data, Source: MICS"]
[null,"Tokealau","No data",null,"Tokealau",null,null,"No data"]
[null,"Tonga","Full data, Source: MICS",null,"Tonga","MICS",null,"Full data, Source: MICS"]
[null,"Trinidad and Tobago","Full data, Source: MICS",null,"Trinidad and Tobago","MICS",null,"Full data, Source: MICS"]
[null,"Tunisia","Full data, Source: MICS",null,"Tunisia","MICS",null,"Full data, Source: MICS"]
[null,"Turkey","Full data, Source: DHS",null,"Turkey","DHS",null,"Full data, Source: DHS"]
[null,"Turkmenistan","Full data, Source: MICS",null,"Turkmenistan","MICS",null,"Full data, Source: MICS"]
[null,"Turks and Caicos Island","Full data, Source: MICS",null,"Turks and Caicos Island","MICS",null,"Full data, Source: MICS"]
[null,"Tuvalu","Full data, Source: MICS",null,"Tuvalu","MICS",null,"Full data, Source: MICS"]
[null,"Uganda","Full data, Source: DHS",null,"Uganda","DHS",null,"Full data, Source: DHS"]
[null,"Ukraine","Full data, Source: MICS",null,"Ukraine","MICS",null,"Full data, Source: MICS"]
[null,"United Arab Emirates","Regional Ave.",null,"United Arab Emirates","Regional Ave.",null,"No data, regional estimates only "]
[null,"United Kingdom","Partial data: Source: LANCET",null,"United Kingdom","LANCET",null,"Partial data: Source: LANCET"]
[null,"United Republic of Tanzania","Full data, Source: DHS",null,"United Republic of Tanzania","DHS",null,"Full data, Source: DHS"]
[null,"United States of America",null,null,"United States of America"]
[null,"United States Virgin Islands","Regional Ave.",null,"United States Virgin Islands","Regional Ave.",null,"No data, regional estimates only "]
[null,"Uruguay","Partial data: Source: LANCET",null,"Uruguay","LANCET",null,"Partial data: Source: LANCET"]
[null,"Uzbekistan","Full data, Source: MICS",null,"Uzbekistan","MICS",null,"Full data, Source: MICS"]
[null,"Vanuatu","No data",null,"Vanuatu",null,null,"No data"]
[null,"Vatican","No data",null,"Vatican",null,null,"No data"]
[null,"Venezuela (Bolivarian Republic of)","Regional Ave.",null,"Venezuela (Bolivarian Republic of)","Regional Ave.",null,"No data, regional estimates only "]
[null,"Viet Nam","Full data, Source: MICS",null,"Viet Nam","MICS",null,"Full data, Source: MICS"]
[null,"Wallis and Futuna","No data",null,"Wallis and Futuna",null,null,"No data"]
[null,"Western Sahara","No data",null,"Western Sahara",null,null,"No data"]
[null,"Yemen","Full data, Source: DHS",null,"Yemen","DHS",null,"Full data, Source: DHS"]
[null,"Zambia","Full data, Source: DHS",null,"Zambia","DHS",null,"Full data, Source: DHS"]
[null,"Zimbabwe","Full data, Source: MICS",null,"Zimbabwe","MICS",null,"Full data, Source: MICS"]